{"text_format":"1","workbook":"xlsx","n_sheets":17,"sheets":["Ergebnis","Meldung (Reihung nach Spielnr.)","Auslosung1","Runde 1","Auslosung2","Runde 2","Auslosung3","Runde 3","Auslosung4","Runde 4","Auslosung5","Runde 5","Auslosung6","Runde 6","Auslosung7","Runde 7","Hinweis"],"not_rendered":{"charts":0,"images":3,"macros":1,"external_links":0,"defined_names":102,"comments":0,"pivot_tables":0},"unopened":[],"bounds":{"document_bytes":16777216,"sheet_cells":100000,"rows_first":2000,"rows_last":500,"rows_between":2000,"halvings":0,"cell_chars":16384,"cell_head_chars":4096},"cells_cut":0,"cells_raw":0,"read":"whole","date_system":"1900"}

{"sheet":"Ergebnis","index":0,"n_rows":97,"n_cols":12,"rows_kept":97,"cut":false,"hidden":false,"merged":[]}
["Platz","Paar Nr","Name","Punkte",null,"RANG",null,null,{"$f":"COUNTIF(C2:C97,\"*\")","v":40},"Spieler",null,"Powered by:"]
[1,{"$f":"'Meldung (Reihung nach Spielnr.)'!B4","v":3},{"$f":"'Meldung (Reihung nach Spielnr.)'!C4","v":"Hubert Auer u Daniela Nöbauer/Telfs"},{"$f":"'Meldung (Reihung nach Spielnr.)'!K4","v":0},null,{"$f":"RANK(D2,D$2:D$21)","v":5}," ",null,"RANG(D2;D$2:D$41)"]
[2,{"$f":"'Meldung (Reihung nach Spielnr.)'!B5","v":4},{"$f":"'Meldung (Reihung nach Spielnr.)'!C5","v":"Andi Krajic u Peter Doblander/Tarrenz"},{"$f":"'Meldung (Reihung nach Spielnr.)'!K5","v":0},null,{"$f":"RANK(D3,D$2:D$21)","v":5}," ",null,"bei mehr Spielern Formel anpassen"]
[3,{"$f":"'Meldung (Reihung nach Spielnr.)'!B6","v":5},{"$f":"'Meldung (Reihung nach Spielnr.)'!C6","v":"Gerhard Schuler u Meinhard Eiter/Imst"},{"$f":"'Meldung (Reihung nach Spielnr.)'!K6","v":0},null,5]
[4,{"$f":"'Meldung (Reihung nach Spielnr.)'!B7","v":6},{"$f":"'Meldung (Reihung nach Spielnr.)'!C7","v":"Hans Perktold u Horst Friedl/Imst"},{"$f":"'Meldung (Reihung nach Spielnr.)'!K7","v":0},null,5,null,null,null,null,null,"Mag. Martin Weinfurtner"]
[5,{"$f":"'Meldung (Reihung nach Spielnr.)'!B9","v":8},{"$f":"'Meldung (Reihung nach Spielnr.)'!C9","v":"Herbert Lechleitner u  Stefan Krabichler/Imst"},{"$f":"'Meldung (Reihung nach Spielnr.)'!K9","v":0},null,5]
[6,{"$f":"'Meldung (Reihung nach Spielnr.)'!B10","v":9},{"$f":"'Meldung (Reihung nach Spielnr.)'!C10","v":"Rudi Kastner u Peter Tschenett/Imst"},{"$f":"'Meldung (Reihung nach Spielnr.)'!K10","v":0},null,5]
[7,{"$f":"'Meldung (Reihung nach Spielnr.)'!B11","v":10},{"$f":"'Meldung (Reihung nach Spielnr.)'!C11","v":"Franz Pellegrini u Hans Matha/Südtirol"},{"$f":"'Meldung (Reihung nach Spielnr.)'!K11","v":0},null,5]
[8,{"$f":"'Meldung (Reihung nach Spielnr.)'!B12","v":11},{"$f":"'Meldung (Reihung nach Spielnr.)'!C12","v":"Heini Gruber u Gottfried Geier/Südtirol"},{"$f":"'Meldung (Reihung nach Spielnr.)'!K12","v":0},null,5]
[9,{"$f":"'Meldung (Reihung nach Spielnr.)'!B13","v":12},{"$f":"'Meldung (Reihung nach Spielnr.)'!C13","v":"Heinrich Ebner u Erich Peer/Südtirol"},{"$f":"'Meldung (Reihung nach Spielnr.)'!K13","v":0},null,5]
[10,{"$f":"'Meldung (Reihung nach Spielnr.)'!B14","v":13},{"$f":"'Meldung (Reihung nach Spielnr.)'!C14","v":"Peter Auer u Stefan Sarg/Axams"},{"$f":"'Meldung (Reihung nach Spielnr.)'!K14","v":0},null,5]
[11,{"$f":"'Meldung (Reihung nach Spielnr.)'!B15","v":14},{"$f":"'Meldung (Reihung nach Spielnr.)'!C15","v":"Hansjörg Hell u Franz Braunegger/Axams"},{"$f":"'Meldung (Reihung nach Spielnr.)'!K15","v":0},null,5]
[12,{"$f":"'Meldung (Reihung nach Spielnr.)'!B16","v":15},{"$f":"'Meldung (Reihung nach Spielnr.)'!C16","v":"Bernhard Meischberger u Martin Staggl/Kematen"},{"$f":"'Meldung (Reihung nach Spielnr.)'!K16","v":0},null,5]
[13,{"$f":"'Meldung (Reihung nach Spielnr.)'!B17","v":16},{"$f":"'Meldung (Reihung nach Spielnr.)'!C17","v":"Hermann Lechner u Andreas Oberacher/Kematen"},{"$f":"'Meldung (Reihung nach Spielnr.)'!K17","v":0},null,5]
[14,{"$f":"'Meldung (Reihung nach Spielnr.)'!B19","v":18},{"$f":"'Meldung (Reihung nach Spielnr.)'!C19","v":"Josef Eisenbeutl u Herbert Gamper/Imst"},{"$f":"'Meldung (Reihung nach Spielnr.)'!K19","v":0},null,5]
[15,{"$f":"'Meldung (Reihung nach Spielnr.)'!B20","v":19},{"$f":"'Meldung (Reihung nach Spielnr.)'!C20","v":"Kurt Zebisch | Mr. Bean"},{"$f":"'Meldung (Reihung nach Spielnr.)'!K20","v":0},null,5]
[16,{"$f":"'Meldung (Reihung nach Spielnr.)'!B21","v":20},{"$f":"'Meldung (Reihung nach Spielnr.)'!C21","v":"Krissmer Reinhard | Fringer Fred"},{"$f":"'Meldung (Reihung nach Spielnr.)'!K21","v":0},null,5]
[17,{"$f":"'Meldung (Reihung nach Spielnr.)'!B2","v":1},{"$f":"'Meldung (Reihung nach Spielnr.)'!C2","v":"Edi u Gerald/Telfs"},{"$f":"'Meldung (Reihung nach Spielnr.)'!K2","v":3},null,3]
[18,{"$f":"'Meldung (Reihung nach Spielnr.)'!B8","v":7},{"$f":"'Meldung (Reihung nach Spielnr.)'!C8","v":"Thomas Heltschl u Fredl Mungenast/Imst"},{"$f":"'Meldung (Reihung nach Spielnr.)'!K8","v":3},null,3," "]
[19,{"$f":"'Meldung (Reihung nach Spielnr.)'!B3","v":2},{"$f":"'Meldung (Reihung nach Spielnr.)'!C3","v":"Annette u Veronika/Telfs"},{"$f":"'Meldung (Reihung nach Spielnr.)'!K3","v":112},null,1]
[20,{"$f":"'Meldung (Reihung nach Spielnr.)'!B18","v":17},{"$f":"'Meldung (Reihung nach Spielnr.)'!C18","v":"Karin Logar u Rudolf Häusler/Kematen"},{"$f":"'Meldung (Reihung nach Spielnr.)'!K18","v":112},null,1]
[21,{"$f":"'Meldung (Reihung nach Spielnr.)'!B22","v":21},{"$f":"'Meldung (Reihung nach Spielnr.)'!C22","v":"c"},{"$f":"'Meldung (Reihung nach Spielnr.)'!K22","v":{"$error":"#N/A"}},null,{"$f":"RANK(D22,D$2:D$41)","v":{"$error":"#N/A"}}]
[22,{"$f":"'Meldung (Reihung nach Spielnr.)'!B23","v":22},{"$f":"'Meldung (Reihung nach Spielnr.)'!C23","v":"d"},{"$f":"'Meldung (Reihung nach Spielnr.)'!K23","v":{"$error":"#N/A"}},null,{"$error":"#N/A"}]
[23,{"$f":"'Meldung (Reihung nach Spielnr.)'!B24","v":23},{"$f":"'Meldung (Reihung nach Spielnr.)'!C24","v":"e "},{"$f":"'Meldung (Reihung nach Spielnr.)'!K24","v":{"$error":"#N/A"}},null,{"$error":"#N/A"}]
[24,{"$f":"'Meldung (Reihung nach Spielnr.)'!B25","v":24},{"$f":"'Meldung (Reihung nach Spielnr.)'!C25","v":"f "},{"$f":"'Meldung (Reihung nach Spielnr.)'!K25","v":{"$error":"#N/A"}},null,{"$error":"#N/A"}]
[25,{"$f":"'Meldung (Reihung nach Spielnr.)'!B26","v":25},{"$f":"'Meldung (Reihung nach Spielnr.)'!C26","v":"g "},{"$f":"'Meldung (Reihung nach Spielnr.)'!K26","v":{"$error":"#N/A"}},null,{"$error":"#N/A"}]
[26,{"$f":"'Meldung (Reihung nach Spielnr.)'!B27","v":26},{"$f":"'Meldung (Reihung nach Spielnr.)'!C27","v":"h "},{"$f":"'Meldung (Reihung nach Spielnr.)'!K27","v":{"$error":"#N/A"}},null,{"$error":"#N/A"}]
[27,{"$f":"'Meldung (Reihung nach Spielnr.)'!B28","v":27},{"$f":"'Meldung (Reihung nach Spielnr.)'!C28","v":"i "},{"$f":"'Meldung (Reihung nach Spielnr.)'!K28","v":{"$error":"#N/A"}},null,{"$error":"#N/A"}]
[28,{"$f":"'Meldung (Reihung nach Spielnr.)'!B29","v":28},{"$f":"'Meldung (Reihung nach Spielnr.)'!C29","v":"j "},{"$f":"'Meldung (Reihung nach Spielnr.)'!K29","v":{"$error":"#N/A"}},null,{"$error":"#N/A"}]
[29,{"$f":"'Meldung (Reihung nach Spielnr.)'!B30","v":29},{"$f":"'Meldung (Reihung nach Spielnr.)'!C30","v":"k "},{"$f":"'Meldung (Reihung nach Spielnr.)'!K30","v":{"$error":"#N/A"}},null,{"$error":"#N/A"}]
[30,{"$f":"'Meldung (Reihung nach Spielnr.)'!B31","v":30},{"$f":"'Meldung (Reihung nach Spielnr.)'!C31","v":"l "},{"$f":"'Meldung (Reihung nach Spielnr.)'!K31","v":{"$error":"#N/A"}},null,{"$error":"#N/A"}]
[31,{"$f":"'Meldung (Reihung nach Spielnr.)'!B32","v":31},{"$f":"'Meldung (Reihung nach Spielnr.)'!C32","v":"m "},{"$f":"'Meldung (Reihung nach Spielnr.)'!K32","v":{"$error":"#N/A"}},null,{"$error":"#N/A"}]
[32,{"$f":"'Meldung (Reihung nach Spielnr.)'!B33","v":32},{"$f":"'Meldung (Reihung nach Spielnr.)'!C33","v":"n "},{"$f":"'Meldung (Reihung nach Spielnr.)'!K33","v":{"$error":"#N/A"}},null,{"$error":"#N/A"}]
[33,{"$f":"'Meldung (Reihung nach Spielnr.)'!B34","v":33},{"$f":"'Meldung (Reihung nach Spielnr.)'!C34","v":"o "},{"$f":"'Meldung (Reihung nach Spielnr.)'!K34","v":{"$error":"#N/A"}},null,{"$error":"#N/A"}]
[34,{"$f":"'Meldung (Reihung nach Spielnr.)'!B35","v":34},{"$f":"'Meldung (Reihung nach Spielnr.)'!C35","v":"p "},{"$f":"'Meldung (Reihung nach Spielnr.)'!K35","v":{"$error":"#N/A"}},null,{"$error":"#N/A"}]
[35,{"$f":"'Meldung (Reihung nach Spielnr.)'!B36","v":35},{"$f":"'Meldung (Reihung nach Spielnr.)'!C36","v":"q "},{"$f":"'Meldung (Reihung nach Spielnr.)'!K36","v":{"$error":"#N/A"}},null,{"$error":"#N/A"}]
[36,{"$f":"'Meldung (Reihung nach Spielnr.)'!B37","v":36},{"$f":"'Meldung (Reihung nach Spielnr.)'!C37","v":"r "},{"$f":"'Meldung (Reihung nach Spielnr.)'!K37","v":{"$error":"#N/A"}},null,{"$error":"#N/A"}]
[37,{"$f":"'Meldung (Reihung nach Spielnr.)'!B38","v":37},{"$f":"'Meldung (Reihung nach Spielnr.)'!C38","v":"s "},{"$f":"'Meldung (Reihung nach Spielnr.)'!K38","v":{"$error":"#N/A"}},null,{"$error":"#N/A"}]
[38,{"$f":"'Meldung (Reihung nach Spielnr.)'!B39","v":38},{"$f":"'Meldung (Reihung nach Spielnr.)'!C39","v":"t "},{"$f":"'Meldung (Reihung nach Spielnr.)'!K39","v":{"$error":"#N/A"}},null,{"$error":"#N/A"}]
[39,{"$f":"'Meldung (Reihung nach Spielnr.)'!B40","v":39},{"$f":"'Meldung (Reihung nach Spielnr.)'!C40","v":"u"},{"$f":"'Meldung (Reihung nach Spielnr.)'!K40","v":{"$error":"#N/A"}},null,{"$error":"#N/A"}]
[40,{"$f":"'Meldung (Reihung nach Spielnr.)'!B41","v":40},{"$f":"'Meldung (Reihung nach Spielnr.)'!C41","v":"v"},{"$f":"'Meldung (Reihung nach Spielnr.)'!K41","v":{"$error":"#N/A"}},null,{"$error":"#N/A"}]
[41,{"$f":"'Meldung (Reihung nach Spielnr.)'!B42","v":41},{"$f":"'Meldung (Reihung nach Spielnr.)'!C42","v":0},{"$f":"'Meldung (Reihung nach Spielnr.)'!K42","v":{"$error":"#N/A"}},null,{"$error":"#N/A"}]
[42,{"$f":"'Meldung (Reihung nach Spielnr.)'!B43","v":42},{"$f":"'Meldung (Reihung nach Spielnr.)'!C43","v":0},{"$f":"'Meldung (Reihung nach Spielnr.)'!K43","v":{"$error":"#N/A"}},null,{"$error":"#N/A"}]
[43,{"$f":"'Meldung (Reihung nach Spielnr.)'!B44","v":43},{"$f":"'Meldung (Reihung nach Spielnr.)'!C44","v":0},{"$f":"'Meldung (Reihung nach Spielnr.)'!K44","v":{"$error":"#N/A"}},null,{"$error":"#N/A"}]
[44,{"$f":"'Meldung (Reihung nach Spielnr.)'!B45","v":44},{"$f":"'Meldung (Reihung nach Spielnr.)'!C45","v":0},{"$f":"'Meldung (Reihung nach Spielnr.)'!K45","v":{"$error":"#N/A"}},null,{"$error":"#N/A"}]
[45,{"$f":"'Meldung (Reihung nach Spielnr.)'!B46","v":45},{"$f":"'Meldung (Reihung nach Spielnr.)'!C46","v":0},{"$f":"'Meldung (Reihung nach Spielnr.)'!K46","v":{"$error":"#N/A"}},null,{"$error":"#N/A"}]
[46,{"$f":"'Meldung (Reihung nach Spielnr.)'!B47","v":46},{"$f":"'Meldung (Reihung nach Spielnr.)'!C47","v":0},{"$f":"'Meldung (Reihung nach Spielnr.)'!K47","v":{"$error":"#N/A"}},null,{"$error":"#N/A"}]
[47,{"$f":"'Meldung (Reihung nach Spielnr.)'!B48","v":47},{"$f":"'Meldung (Reihung nach Spielnr.)'!C48","v":0},{"$f":"'Meldung (Reihung nach Spielnr.)'!K48","v":{"$error":"#N/A"}},null,{"$error":"#N/A"}]
[48,{"$f":"'Meldung (Reihung nach Spielnr.)'!B49","v":48},{"$f":"'Meldung (Reihung nach Spielnr.)'!C49","v":0},{"$f":"'Meldung (Reihung nach Spielnr.)'!K49","v":{"$error":"#N/A"}},null,{"$error":"#N/A"}]
[49,{"$f":"'Meldung (Reihung nach Spielnr.)'!B50","v":49},{"$f":"'Meldung (Reihung nach Spielnr.)'!C50","v":0},{"$f":"'Meldung (Reihung nach Spielnr.)'!K50","v":{"$error":"#N/A"}},null,{"$error":"#N/A"}]
[50,{"$f":"'Meldung (Reihung nach Spielnr.)'!B51","v":50},{"$f":"'Meldung (Reihung nach Spielnr.)'!C51","v":0},{"$f":"'Meldung (Reihung nach Spielnr.)'!K51","v":{"$error":"#N/A"}},null,{"$error":"#N/A"}]
[51,{"$f":"'Meldung (Reihung nach Spielnr.)'!B52","v":51},{"$f":"'Meldung (Reihung nach Spielnr.)'!C52","v":0},{"$f":"'Meldung (Reihung nach Spielnr.)'!K52","v":{"$error":"#N/A"}},null,{"$error":"#N/A"}]
[52,{"$f":"'Meldung (Reihung nach Spielnr.)'!B53","v":52},{"$f":"'Meldung (Reihung nach Spielnr.)'!C53","v":0},{"$f":"'Meldung (Reihung nach Spielnr.)'!K53","v":{"$error":"#N/A"}},null,{"$error":"#N/A"}]
[53,{"$f":"'Meldung (Reihung nach Spielnr.)'!B54","v":53},{"$f":"'Meldung (Reihung nach Spielnr.)'!C54","v":0},{"$f":"'Meldung (Reihung nach Spielnr.)'!K54","v":{"$error":"#N/A"}},null,{"$error":"#N/A"}]
[54,{"$f":"'Meldung (Reihung nach Spielnr.)'!B55","v":54},{"$f":"'Meldung (Reihung nach Spielnr.)'!C55","v":0},{"$f":"'Meldung (Reihung nach Spielnr.)'!K55","v":{"$error":"#N/A"}},null,{"$error":"#N/A"}]
[55,{"$f":"'Meldung (Reihung nach Spielnr.)'!B56","v":55},{"$f":"'Meldung (Reihung nach Spielnr.)'!C56","v":0},{"$f":"'Meldung (Reihung nach Spielnr.)'!K56","v":{"$error":"#N/A"}},null,{"$error":"#N/A"}]
[56,{"$f":"'Meldung (Reihung nach Spielnr.)'!B57","v":56},{"$f":"'Meldung (Reihung nach Spielnr.)'!C57","v":0},{"$f":"'Meldung (Reihung nach Spielnr.)'!K57","v":{"$error":"#N/A"}},null,{"$error":"#N/A"}]
[57,{"$f":"'Meldung (Reihung nach Spielnr.)'!B58","v":57},{"$f":"'Meldung (Reihung nach Spielnr.)'!C58","v":0},{"$f":"'Meldung (Reihung nach Spielnr.)'!K58","v":{"$error":"#N/A"}},null,{"$error":"#N/A"}]
[58,{"$f":"'Meldung (Reihung nach Spielnr.)'!B59","v":58},{"$f":"'Meldung (Reihung nach Spielnr.)'!C59","v":0},{"$f":"'Meldung (Reihung nach Spielnr.)'!K59","v":{"$error":"#N/A"}},null,{"$error":"#N/A"}]
[59,{"$f":"'Meldung (Reihung nach Spielnr.)'!B60","v":59},{"$f":"'Meldung (Reihung nach Spielnr.)'!C60","v":0},{"$f":"'Meldung (Reihung nach Spielnr.)'!K60","v":{"$error":"#N/A"}},null,{"$error":"#N/A"}]
[60,{"$f":"'Meldung (Reihung nach Spielnr.)'!B61","v":60},{"$f":"'Meldung (Reihung nach Spielnr.)'!C61","v":0},{"$f":"'Meldung (Reihung nach Spielnr.)'!K61","v":{"$error":"#N/A"}},null,{"$error":"#N/A"}]
[61,{"$f":"'Meldung (Reihung nach Spielnr.)'!B62","v":61},{"$f":"'Meldung (Reihung nach Spielnr.)'!C62","v":0},{"$f":"'Meldung (Reihung nach Spielnr.)'!K62","v":{"$error":"#N/A"}},null,{"$error":"#N/A"}]
[62,{"$f":"'Meldung (Reihung nach Spielnr.)'!B63","v":62},{"$f":"'Meldung (Reihung nach Spielnr.)'!C63","v":0},{"$f":"'Meldung (Reihung nach Spielnr.)'!K63","v":{"$error":"#N/A"}},null,{"$error":"#N/A"}]
[63,{"$f":"'Meldung (Reihung nach Spielnr.)'!B64","v":63},{"$f":"'Meldung (Reihung nach Spielnr.)'!C64","v":0},{"$f":"'Meldung (Reihung nach Spielnr.)'!K64","v":{"$error":"#N/A"}},null,{"$error":"#N/A"}]
[64,{"$f":"'Meldung (Reihung nach Spielnr.)'!B65","v":64},{"$f":"'Meldung (Reihung nach Spielnr.)'!C65","v":0},{"$f":"'Meldung (Reihung nach Spielnr.)'!K65","v":{"$error":"#N/A"}},null,{"$error":"#N/A"}]
[65,{"$f":"'Meldung (Reihung nach Spielnr.)'!B66","v":65},{"$f":"'Meldung (Reihung nach Spielnr.)'!C66","v":0},{"$f":"'Meldung (Reihung nach Spielnr.)'!K66","v":{"$error":"#N/A"}},null,{"$error":"#N/A"}]
[66,{"$f":"'Meldung (Reihung nach Spielnr.)'!B67","v":66},{"$f":"'Meldung (Reihung nach Spielnr.)'!C67","v":0},{"$f":"'Meldung (Reihung nach Spielnr.)'!K67","v":{"$error":"#N/A"}},null,{"$error":"#N/A"}]
[67,{"$f":"'Meldung (Reihung nach Spielnr.)'!B68","v":67},{"$f":"'Meldung (Reihung nach Spielnr.)'!C68","v":0},{"$f":"'Meldung (Reihung nach Spielnr.)'!K68","v":{"$error":"#N/A"}},null,{"$error":"#N/A"}]
[68,{"$f":"'Meldung (Reihung nach Spielnr.)'!B69","v":68},{"$f":"'Meldung (Reihung nach Spielnr.)'!C69","v":0},{"$f":"'Meldung (Reihung nach Spielnr.)'!K69","v":{"$error":"#N/A"}},null,{"$error":"#N/A"}]
[69,{"$f":"'Meldung (Reihung nach Spielnr.)'!B70","v":69},{"$f":"'Meldung (Reihung nach Spielnr.)'!C70","v":0},{"$f":"'Meldung (Reihung nach Spielnr.)'!K70","v":{"$error":"#N/A"}},null,{"$error":"#N/A"}]
[70,{"$f":"'Meldung (Reihung nach Spielnr.)'!B71","v":70},{"$f":"'Meldung (Reihung nach Spielnr.)'!C71","v":0},{"$f":"'Meldung (Reihung nach Spielnr.)'!K71","v":{"$error":"#N/A"}},null,{"$error":"#N/A"}]
[71,{"$f":"'Meldung (Reihung nach Spielnr.)'!B72","v":71},{"$f":"'Meldung (Reihung nach Spielnr.)'!C72","v":0},{"$f":"'Meldung (Reihung nach Spielnr.)'!K72","v":{"$error":"#N/A"}},null,{"$error":"#N/A"}]
[72,{"$f":"'Meldung (Reihung nach Spielnr.)'!B73","v":72},{"$f":"'Meldung (Reihung nach Spielnr.)'!C73","v":0},{"$f":"'Meldung (Reihung nach Spielnr.)'!K73","v":{"$error":"#N/A"}},null,{"$error":"#N/A"}]
[73,{"$f":"'Meldung (Reihung nach Spielnr.)'!B74","v":73},{"$f":"'Meldung (Reihung nach Spielnr.)'!C74","v":0},{"$f":"'Meldung (Reihung nach Spielnr.)'!K74","v":{"$error":"#N/A"}},null,{"$error":"#N/A"}]
[74,{"$f":"'Meldung (Reihung nach Spielnr.)'!B75","v":74},{"$f":"'Meldung (Reihung nach Spielnr.)'!C75","v":0},{"$f":"'Meldung (Reihung nach Spielnr.)'!K75","v":{"$error":"#N/A"}},null,{"$error":"#N/A"}]
[75,{"$f":"'Meldung (Reihung nach Spielnr.)'!B76","v":75},{"$f":"'Meldung (Reihung nach Spielnr.)'!C76","v":0},{"$f":"'Meldung (Reihung nach Spielnr.)'!K76","v":{"$error":"#N/A"}},null,{"$error":"#N/A"}]
[76,{"$f":"'Meldung (Reihung nach Spielnr.)'!B77","v":76},{"$f":"'Meldung (Reihung nach Spielnr.)'!C77","v":0},{"$f":"'Meldung (Reihung nach Spielnr.)'!K77","v":{"$error":"#N/A"}},null,{"$error":"#N/A"}]
[77,{"$f":"'Meldung (Reihung nach Spielnr.)'!B78","v":77},{"$f":"'Meldung (Reihung nach Spielnr.)'!C78","v":0},{"$f":"'Meldung (Reihung nach Spielnr.)'!K78","v":{"$error":"#N/A"}},null,{"$error":"#N/A"}]
[78,{"$f":"'Meldung (Reihung nach Spielnr.)'!B79","v":78},{"$f":"'Meldung (Reihung nach Spielnr.)'!C79","v":0},{"$f":"'Meldung (Reihung nach Spielnr.)'!K79","v":{"$error":"#N/A"}},null,{"$error":"#N/A"}]
[79,{"$f":"'Meldung (Reihung nach Spielnr.)'!B80","v":79},{"$f":"'Meldung (Reihung nach Spielnr.)'!C80","v":0},{"$f":"'Meldung (Reihung nach Spielnr.)'!K80","v":{"$error":"#N/A"}},null,{"$error":"#N/A"}]
[80,{"$f":"'Meldung (Reihung nach Spielnr.)'!B81","v":80},{"$f":"'Meldung (Reihung nach Spielnr.)'!C81","v":0},{"$f":"'Meldung (Reihung nach Spielnr.)'!K81","v":{"$error":"#N/A"}},null,{"$error":"#N/A"}]
[81,{"$f":"'Meldung (Reihung nach Spielnr.)'!B82","v":81},{"$f":"'Meldung (Reihung nach Spielnr.)'!C82","v":0},{"$f":"'Meldung (Reihung nach Spielnr.)'!K82","v":{"$error":"#N/A"}},null,{"$error":"#N/A"}]
[82,{"$f":"'Meldung (Reihung nach Spielnr.)'!B83","v":82},{"$f":"'Meldung (Reihung nach Spielnr.)'!C83","v":0},{"$f":"'Meldung (Reihung nach Spielnr.)'!K83","v":{"$error":"#N/A"}},null,{"$error":"#N/A"}]
[83,{"$f":"'Meldung (Reihung nach Spielnr.)'!B84","v":83},{"$f":"'Meldung (Reihung nach Spielnr.)'!C84","v":0},{"$f":"'Meldung (Reihung nach Spielnr.)'!K84","v":{"$error":"#N/A"}},null,{"$f":"RANK(D84,D$2:D$41)","v":{"$error":"#N/A"}}]
[84,{"$f":"'Meldung (Reihung nach Spielnr.)'!B85","v":84},{"$f":"'Meldung (Reihung nach Spielnr.)'!C85","v":0},{"$f":"'Meldung (Reihung nach Spielnr.)'!K85","v":{"$error":"#N/A"}},null,{"$error":"#N/A"}]
[85,{"$f":"'Meldung (Reihung nach Spielnr.)'!B86","v":85},{"$f":"'Meldung (Reihung nach Spielnr.)'!C86","v":0},{"$f":"'Meldung (Reihung nach Spielnr.)'!K86","v":{"$error":"#N/A"}},null,{"$error":"#N/A"}]
[86,{"$f":"'Meldung (Reihung nach Spielnr.)'!B87","v":86},{"$f":"'Meldung (Reihung nach Spielnr.)'!C87","v":0},{"$f":"'Meldung (Reihung nach Spielnr.)'!K87","v":{"$error":"#N/A"}},null,{"$error":"#N/A"}]
[87,{"$f":"'Meldung (Reihung nach Spielnr.)'!B88","v":87},{"$f":"'Meldung (Reihung nach Spielnr.)'!C88","v":0},{"$f":"'Meldung (Reihung nach Spielnr.)'!K88","v":{"$error":"#N/A"}},null,{"$error":"#N/A"}]
[88,{"$f":"'Meldung (Reihung nach Spielnr.)'!B89","v":88},{"$f":"'Meldung (Reihung nach Spielnr.)'!C89","v":0},{"$f":"'Meldung (Reihung nach Spielnr.)'!K89","v":{"$error":"#N/A"}},null,{"$error":"#N/A"}]
[89,{"$f":"'Meldung (Reihung nach Spielnr.)'!B90","v":89},{"$f":"'Meldung (Reihung nach Spielnr.)'!C90","v":0},{"$f":"'Meldung (Reihung nach Spielnr.)'!K90","v":{"$error":"#N/A"}},null,{"$error":"#N/A"}]
[90,{"$f":"'Meldung (Reihung nach Spielnr.)'!B91","v":90},{"$f":"'Meldung (Reihung nach Spielnr.)'!C91","v":0},{"$f":"'Meldung (Reihung nach Spielnr.)'!K91","v":{"$error":"#N/A"}},null,{"$error":"#N/A"}]
[91,{"$f":"'Meldung (Reihung nach Spielnr.)'!B92","v":91},{"$f":"'Meldung (Reihung nach Spielnr.)'!C92","v":0},{"$f":"'Meldung (Reihung nach Spielnr.)'!K92","v":{"$error":"#N/A"}},null,{"$error":"#N/A"}]
[92,{"$f":"'Meldung (Reihung nach Spielnr.)'!B93","v":92},{"$f":"'Meldung (Reihung nach Spielnr.)'!C93","v":0},{"$f":"'Meldung (Reihung nach Spielnr.)'!K93","v":{"$error":"#N/A"}},null,{"$error":"#N/A"}]
[93,{"$f":"'Meldung (Reihung nach Spielnr.)'!B94","v":93},{"$f":"'Meldung (Reihung nach Spielnr.)'!C94","v":0},{"$f":"'Meldung (Reihung nach Spielnr.)'!K94","v":{"$error":"#N/A"}},null,{"$error":"#N/A"}]
[94,{"$f":"'Meldung (Reihung nach Spielnr.)'!B95","v":94},{"$f":"'Meldung (Reihung nach Spielnr.)'!C95","v":0},{"$f":"'Meldung (Reihung nach Spielnr.)'!K95","v":{"$error":"#N/A"}},null,{"$error":"#N/A"}]
[95,{"$f":"'Meldung (Reihung nach Spielnr.)'!B96","v":95},{"$f":"'Meldung (Reihung nach Spielnr.)'!C96","v":0},{"$f":"'Meldung (Reihung nach Spielnr.)'!K96","v":{"$error":"#N/A"}},null,{"$error":"#N/A"}]
[96,{"$f":"'Meldung (Reihung nach Spielnr.)'!B97","v":96},{"$f":"'Meldung (Reihung nach Spielnr.)'!C97","v":0},{"$f":"'Meldung (Reihung nach Spielnr.)'!K97","v":{"$error":"#N/A"}},null,{"$error":"#N/A"}]

{"sheet":"Meldung (Reihung nach Spielnr.)","index":1,"n_rows":97,"n_cols":25,"rows_kept":97,"cut":false,"hidden":false,"merged":[]}
[{"$f":"COUNTIF(C2:C97,\"*\")","v":40},"Paarnummer","Namen","Runde 1","Runde 2","Runde 3","Runde 4","Runde 5","Runde 6","Runde 7","Ges.","RANG",20,null,null,null,null,null,"ANZAHL:",{"$f":"COUNTIF(C2:C100,\"*\")","v":40},null,null,null,null,"Powered by:"]
[null,1,"Edi u Gerald/Telfs",{"$f":"VLOOKUP($B2,'Runde 1'!$A$2:$C$97,3,0)","v":0},{"$f":"VLOOKUP($B2,'Runde 2'!$A$2:$C$97,3,0)","v":0},{"$f":"VLOOKUP($B2,'Runde 3'!$A$2:$C$97,3,0)","v":0},{"$f":"VLOOKUP($B2,'Runde 4'!$A$2:$C$97,3,0)","v":3},{"$f":"VLOOKUP($B2,'Runde 5'!$A$2:$C$97,3,0)","v":0},{"$f":"VLOOKUP($B2,'Runde 6'!$A$2:$C$97,3,0)","v":0},{"$f":"VLOOKUP($B2,'Runde 7'!$A$2:$C$97,3,0)","v":0},{"$f":"SUM(D2:J2)","v":3},{"$f":"RANK(K2,K$2:K$21)","v":3}," ","RANG(M2;M$2:M20)"]
[null,2,"Annette u Veronika/Telfs",{"$f":"VLOOKUP($B3,'Runde 1'!$A$2:$C$97,3,0)","v":112},{"$f":"VLOOKUP($B3,'Runde 2'!$A$2:$C$97,3,0)","v":0},{"$f":"VLOOKUP($B3,'Runde 3'!$A$2:$C$97,3,0)","v":0},{"$f":"VLOOKUP($B3,'Runde 4'!$A$2:$C$97,3,0)","v":0},{"$f":"VLOOKUP($B3,'Runde 5'!$A$2:$C$97,3,0)","v":0},{"$f":"VLOOKUP($B3,'Runde 6'!$A$2:$C$97,3,0)","v":0},{"$f":"VLOOKUP($B3,'Runde 7'!$A$2:$C$97,3,0)","v":0},{"$f":"SUM(D3:J3)","v":112},{"$f":"RANK(K3,K$2:K$21)","v":1},null,"Formel nach Tischen anpassen"]
[null,3,"Hubert Auer u Daniela Nöbauer/Telfs",{"$f":"VLOOKUP($B4,'Runde 1'!$A$2:$C$97,3,0)","v":0},{"$f":"VLOOKUP($B4,'Runde 2'!$A$2:$C$97,3,0)","v":0},{"$f":"VLOOKUP($B4,'Runde 3'!$A$2:$C$97,3,0)","v":0},{"$f":"VLOOKUP($B4,'Runde 4'!$A$2:$C$97,3,0)","v":0},{"$f":"VLOOKUP($B4,'Runde 5'!$A$2:$C$97,3,0)","v":0},{"$f":"VLOOKUP($B4,'Runde 6'!$A$2:$C$97,3,0)","v":0},{"$f":"VLOOKUP($B4,'Runde 7'!$A$2:$C$97,3,0)","v":0},0,5]
[null,4,"Andi Krajic u Peter Doblander/Tarrenz",{"$f":"VLOOKUP($B5,'Runde 1'!$A$2:$C$97,3,0)","v":0},{"$f":"VLOOKUP($B5,'Runde 2'!$A$2:$C$97,3,0)","v":0},{"$f":"VLOOKUP($B5,'Runde 3'!$A$2:$C$97,3,0)","v":0},{"$f":"VLOOKUP($B5,'Runde 4'!$A$2:$C$97,3,0)","v":0},{"$f":"VLOOKUP($B5,'Runde 5'!$A$2:$C$97,3,0)","v":0},{"$f":"VLOOKUP($B5,'Runde 6'!$A$2:$C$97,3,0)","v":0},{"$f":"VLOOKUP($B5,'Runde 7'!$A$2:$C$97,3,0)","v":0},0,5]
[null,5,"Gerhard Schuler u Meinhard Eiter/Imst",{"$f":"VLOOKUP($B6,'Runde 1'!$A$2:$C$97,3,0)","v":0},{"$f":"VLOOKUP($B6,'Runde 2'!$A$2:$C$97,3,0)","v":0},{"$f":"VLOOKUP($B6,'Runde 3'!$A$2:$C$97,3,0)","v":0},{"$f":"VLOOKUP($B6,'Runde 4'!$A$2:$C$97,3,0)","v":0},{"$f":"VLOOKUP($B6,'Runde 5'!$A$2:$C$97,3,0)","v":0},{"$f":"VLOOKUP($B6,'Runde 6'!$A$2:$C$97,3,0)","v":0},{"$f":"VLOOKUP($B6,'Runde 7'!$A$2:$C$97,3,0)","v":0},0,5]
[null,6,"Hans Perktold u Horst Friedl/Imst",{"$f":"VLOOKUP($B7,'Runde 1'!$A$2:$C$97,3,0)","v":0},{"$f":"VLOOKUP($B7,'Runde 2'!$A$2:$C$97,3,0)","v":0},{"$f":"VLOOKUP($B7,'Runde 3'!$A$2:$C$97,3,0)","v":0},{"$f":"VLOOKUP($B7,'Runde 4'!$A$2:$C$97,3,0)","v":0},{"$f":"VLOOKUP($B7,'Runde 5'!$A$2:$C$97,3,0)","v":0},{"$f":"VLOOKUP($B7,'Runde 6'!$A$2:$C$97,3,0)","v":0},{"$f":"VLOOKUP($B7,'Runde 7'!$A$2:$C$97,3,0)","v":0},0,5]
[null,7,"Thomas Heltschl u Fredl Mungenast/Imst",{"$f":"VLOOKUP($B8,'Runde 1'!$A$2:$C$97,3,0)","v":3},{"$f":"VLOOKUP($B8,'Runde 2'!$A$2:$C$97,3,0)","v":0},{"$f":"VLOOKUP($B8,'Runde 3'!$A$2:$C$97,3,0)","v":0},{"$f":"VLOOKUP($B8,'Runde 4'!$A$2:$C$97,3,0)","v":0},{"$f":"VLOOKUP($B8,'Runde 5'!$A$2:$C$97,3,0)","v":0},{"$f":"VLOOKUP($B8,'Runde 6'!$A$2:$C$97,3,0)","v":0},{"$f":"VLOOKUP($B8,'Runde 7'!$A$2:$C$97,3,0)","v":0},3,3,null,null,null,null,null,null,null,null,null,null,null,null,"Mag. Martin Weinfurtner"]
[null,8,"Herbert Lechleitner u  Stefan Krabichler/Imst",{"$f":"VLOOKUP($B9,'Runde 1'!$A$2:$C$97,3,0)","v":0},{"$f":"VLOOKUP($B9,'Runde 2'!$A$2:$C$97,3,0)","v":0},{"$f":"VLOOKUP($B9,'Runde 3'!$A$2:$C$97,3,0)","v":0},{"$f":"VLOOKUP($B9,'Runde 4'!$A$2:$C$97,3,0)","v":0},{"$f":"VLOOKUP($B9,'Runde 5'!$A$2:$C$97,3,0)","v":0},{"$f":"VLOOKUP($B9,'Runde 6'!$A$2:$C$97,3,0)","v":0},{"$f":"VLOOKUP($B9,'Runde 7'!$A$2:$C$97,3,0)","v":0},0,5]
[null,9,"Rudi Kastner u Peter Tschenett/Imst",{"$f":"VLOOKUP($B10,'Runde 1'!$A$2:$C$97,3,0)","v":0},{"$f":"VLOOKUP($B10,'Runde 2'!$A$2:$C$97,3,0)","v":0},{"$f":"VLOOKUP($B10,'Runde 3'!$A$2:$C$97,3,0)","v":0},{"$f":"VLOOKUP($B10,'Runde 4'!$A$2:$C$97,3,0)","v":0},{"$f":"VLOOKUP($B10,'Runde 5'!$A$2:$C$97,3,0)","v":0},{"$f":"VLOOKUP($B10,'Runde 6'!$A$2:$C$97,3,0)","v":0},{"$f":"VLOOKUP($B10,'Runde 7'!$A$2:$C$97,3,0)","v":0},0,5]
[null,10,"Franz Pellegrini u Hans Matha/Südtirol",{"$f":"VLOOKUP($B11,'Runde 1'!$A$2:$C$97,3,0)","v":0},{"$f":"VLOOKUP($B11,'Runde 2'!$A$2:$C$97,3,0)","v":0},{"$f":"VLOOKUP($B11,'Runde 3'!$A$2:$C$97,3,0)","v":0},{"$f":"VLOOKUP($B11,'Runde 4'!$A$2:$C$97,3,0)","v":0},{"$f":"VLOOKUP($B11,'Runde 5'!$A$2:$C$97,3,0)","v":0},{"$f":"VLOOKUP($B11,'Runde 6'!$A$2:$C$97,3,0)","v":0},{"$f":"VLOOKUP($B11,'Runde 7'!$A$2:$C$97,3,0)","v":0},0,5," "]
[null,11,"Heini Gruber u Gottfried Geier/Südtirol",{"$f":"VLOOKUP($B12,'Runde 1'!$A$2:$C$97,3,0)","v":0},{"$f":"VLOOKUP($B12,'Runde 2'!$A$2:$C$97,3,0)","v":0},{"$f":"VLOOKUP($B12,'Runde 3'!$A$2:$C$97,3,0)","v":0},{"$f":"VLOOKUP($B12,'Runde 4'!$A$2:$C$97,3,0)","v":0},{"$f":"VLOOKUP($B12,'Runde 5'!$A$2:$C$97,3,0)","v":0},{"$f":"VLOOKUP($B12,'Runde 6'!$A$2:$C$97,3,0)","v":0},{"$f":"VLOOKUP($B12,'Runde 7'!$A$2:$C$97,3,0)","v":0},0,5]
[null,12,"Heinrich Ebner u Erich Peer/Südtirol",{"$f":"VLOOKUP($B13,'Runde 1'!$A$2:$C$97,3,0)","v":0},{"$f":"VLOOKUP($B13,'Runde 2'!$A$2:$C$97,3,0)","v":0},{"$f":"VLOOKUP($B13,'Runde 3'!$A$2:$C$97,3,0)","v":0},{"$f":"VLOOKUP($B13,'Runde 4'!$A$2:$C$97,3,0)","v":0},{"$f":"VLOOKUP($B13,'Runde 5'!$A$2:$C$97,3,0)","v":0},{"$f":"VLOOKUP($B13,'Runde 6'!$A$2:$C$97,3,0)","v":0},{"$f":"VLOOKUP($B13,'Runde 7'!$A$2:$C$97,3,0)","v":0},0,5]
[null,13,"Peter Auer u Stefan Sarg/Axams",{"$f":"VLOOKUP($B14,'Runde 1'!$A$2:$C$97,3,0)","v":0},{"$f":"VLOOKUP($B14,'Runde 2'!$A$2:$C$97,3,0)","v":0},{"$f":"VLOOKUP($B14,'Runde 3'!$A$2:$C$97,3,0)","v":0},{"$f":"VLOOKUP($B14,'Runde 4'!$A$2:$C$97,3,0)","v":0},{"$f":"VLOOKUP($B14,'Runde 5'!$A$2:$C$97,3,0)","v":0},{"$f":"VLOOKUP($B14,'Runde 6'!$A$2:$C$97,3,0)","v":0},{"$f":"VLOOKUP($B14,'Runde 7'!$A$2:$C$97,3,0)","v":0},0,5]
[null,14,"Hansjörg Hell u Franz Braunegger/Axams",{"$f":"VLOOKUP($B15,'Runde 1'!$A$2:$C$97,3,0)","v":0},{"$f":"VLOOKUP($B15,'Runde 2'!$A$2:$C$97,3,0)","v":0},{"$f":"VLOOKUP($B15,'Runde 3'!$A$2:$C$97,3,0)","v":0},{"$f":"VLOOKUP($B15,'Runde 4'!$A$2:$C$97,3,0)","v":0},{"$f":"VLOOKUP($B15,'Runde 5'!$A$2:$C$97,3,0)","v":0},{"$f":"VLOOKUP($B15,'Runde 6'!$A$2:$C$97,3,0)","v":0},{"$f":"VLOOKUP($B15,'Runde 7'!$A$2:$C$97,3,0)","v":0},0,5]
[null,15,"Bernhard Meischberger u Martin Staggl/Kematen",{"$f":"VLOOKUP($B16,'Runde 1'!$A$2:$C$97,3,0)","v":0},{"$f":"VLOOKUP($B16,'Runde 2'!$A$2:$C$97,3,0)","v":0},{"$f":"VLOOKUP($B16,'Runde 3'!$A$2:$C$97,3,0)","v":0},{"$f":"VLOOKUP($B16,'Runde 4'!$A$2:$C$97,3,0)","v":0},{"$f":"VLOOKUP($B16,'Runde 5'!$A$2:$C$97,3,0)","v":0},{"$f":"VLOOKUP($B16,'Runde 6'!$A$2:$C$97,3,0)","v":0},{"$f":"VLOOKUP($B16,'Runde 7'!$A$2:$C$97,3,0)","v":0},0,5]
[null,16,"Hermann Lechner u Andreas Oberacher/Kematen",{"$f":"VLOOKUP($B17,'Runde 1'!$A$2:$C$97,3,0)","v":0},{"$f":"VLOOKUP($B17,'Runde 2'!$A$2:$C$97,3,0)","v":0},{"$f":"VLOOKUP($B17,'Runde 3'!$A$2:$C$97,3,0)","v":0},{"$f":"VLOOKUP($B17,'Runde 4'!$A$2:$C$97,3,0)","v":0},{"$f":"VLOOKUP($B17,'Runde 5'!$A$2:$C$97,3,0)","v":0},{"$f":"VLOOKUP($B17,'Runde 6'!$A$2:$C$97,3,0)","v":0},{"$f":"VLOOKUP($B17,'Runde 7'!$A$2:$C$97,3,0)","v":0},0,5]
[null,17,"Karin Logar u Rudolf Häusler/Kematen",{"$f":"VLOOKUP($B18,'Runde 1'!$A$2:$C$97,3,0)","v":0},{"$f":"VLOOKUP($B18,'Runde 2'!$A$2:$C$97,3,0)","v":0},{"$f":"VLOOKUP($B18,'Runde 3'!$A$2:$C$97,3,0)","v":0},{"$f":"VLOOKUP($B18,'Runde 4'!$A$2:$C$97,3,0)","v":112},{"$f":"VLOOKUP($B18,'Runde 5'!$A$2:$C$97,3,0)","v":0},{"$f":"VLOOKUP($B18,'Runde 6'!$A$2:$C$97,3,0)","v":0},{"$f":"VLOOKUP($B18,'Runde 7'!$A$2:$C$97,3,0)","v":0},112,1]
[null,18,"Josef Eisenbeutl u Herbert Gamper/Imst",{"$f":"VLOOKUP($B19,'Runde 1'!$A$2:$C$97,3,0)","v":0},{"$f":"VLOOKUP($B19,'Runde 2'!$A$2:$C$97,3,0)","v":0},{"$f":"VLOOKUP($B19,'Runde 3'!$A$2:$C$97,3,0)","v":0},{"$f":"VLOOKUP($B19,'Runde 4'!$A$2:$C$97,3,0)","v":0},{"$f":"VLOOKUP($B19,'Runde 5'!$A$2:$C$97,3,0)","v":0},{"$f":"VLOOKUP($B19,'Runde 6'!$A$2:$C$97,3,0)","v":0},{"$f":"VLOOKUP($B19,'Runde 7'!$A$2:$C$97,3,0)","v":0},0,5]
[null,19,"Kurt Zebisch | Mr. Bean",{"$f":"VLOOKUP($B20,'Runde 1'!$A$2:$C$97,3,0)","v":0},{"$f":"VLOOKUP($B20,'Runde 2'!$A$2:$C$97,3,0)","v":0},{"$f":"VLOOKUP($B20,'Runde 3'!$A$2:$C$97,3,0)","v":0},{"$f":"VLOOKUP($B20,'Runde 4'!$A$2:$C$97,3,0)","v":0},{"$f":"VLOOKUP($B20,'Runde 5'!$A$2:$C$97,3,0)","v":0},{"$f":"VLOOKUP($B20,'Runde 6'!$A$2:$C$97,3,0)","v":0},{"$f":"VLOOKUP($B20,'Runde 7'!$A$2:$C$97,3,0)","v":0},0,5]
[null,20,"Krissmer Reinhard | Fringer Fred",{"$f":"VLOOKUP($B21,'Runde 1'!$A$2:$C$97,3,0)","v":0},{"$f":"VLOOKUP($B21,'Runde 2'!$A$2:$C$97,3,0)","v":0},{"$f":"VLOOKUP($B21,'Runde 3'!$A$2:$C$97,3,0)","v":0},{"$f":"VLOOKUP($B21,'Runde 4'!$A$2:$C$97,3,0)","v":0},{"$f":"VLOOKUP($B21,'Runde 5'!$A$2:$C$97,3,0)","v":0},{"$f":"VLOOKUP($B21,'Runde 6'!$A$2:$C$97,3,0)","v":0},{"$f":"VLOOKUP($B21,'Runde 7'!$A$2:$C$97,3,0)","v":0},0,5]
[null,21,"c",{"$f":"VLOOKUP($B22,'Runde 1'!$A$2:$C$97,3,0)","v":{"$error":"#N/A"}},{"$f":"VLOOKUP($B22,'Runde 2'!$A$2:$C$97,3,0)","v":{"$error":"#N/A"}},{"$f":"VLOOKUP($B22,'Runde 3'!$A$2:$C$97,3,0)","v":{"$error":"#N/A"}},{"$f":"VLOOKUP($B22,'Runde 4'!$A$2:$C$97,3,0)","v":{"$error":"#N/A"}},{"$f":"VLOOKUP($B22,'Runde 5'!$A$2:$C$97,3,0)","v":{"$error":"#N/A"}},{"$f":"VLOOKUP($B22,'Runde 6'!$A$2:$C$97,3,0)","v":{"$error":"#N/A"}},{"$f":"VLOOKUP($B22,'Runde 7'!$A$2:$C$97,3,0)","v":{"$error":"#N/A"}},{"$error":"#N/A"},{"$f":"RANK(K22,K$2:K$20)","v":{"$error":"#N/A"}}]
[null,22,"d",{"$f":"VLOOKUP($B23,'Runde 1'!$A$2:$C$97,3,0)","v":{"$error":"#N/A"}},{"$f":"VLOOKUP($B23,'Runde 2'!$A$2:$C$97,3,0)","v":{"$error":"#N/A"}},{"$f":"VLOOKUP($B23,'Runde 3'!$A$2:$C$97,3,0)","v":{"$error":"#N/A"}},{"$f":"VLOOKUP($B23,'Runde 4'!$A$2:$C$97,3,0)","v":{"$error":"#N/A"}},{"$f":"VLOOKUP($B23,'Runde 5'!$A$2:$C$97,3,0)","v":{"$error":"#N/A"}},{"$f":"VLOOKUP($B23,'Runde 6'!$A$2:$C$97,3,0)","v":{"$error":"#N/A"}},{"$f":"VLOOKUP($B23,'Runde 7'!$A$2:$C$97,3,0)","v":{"$error":"#N/A"}},{"$error":"#N/A"},{"$error":"#N/A"}]
[null,23,"e ",{"$f":"VLOOKUP($B24,'Runde 1'!$A$2:$C$97,3,0)","v":{"$error":"#N/A"}},{"$f":"VLOOKUP($B24,'Runde 2'!$A$2:$C$97,3,0)","v":{"$error":"#N/A"}},{"$f":"VLOOKUP($B24,'Runde 3'!$A$2:$C$97,3,0)","v":{"$error":"#N/A"}},{"$f":"VLOOKUP($B24,'Runde 4'!$A$2:$C$97,3,0)","v":{"$error":"#N/A"}},{"$f":"VLOOKUP($B24,'Runde 5'!$A$2:$C$97,3,0)","v":{"$error":"#N/A"}},{"$f":"VLOOKUP($B24,'Runde 6'!$A$2:$C$97,3,0)","v":{"$error":"#N/A"}},{"$f":"VLOOKUP($B24,'Runde 7'!$A$2:$C$97,3,0)","v":{"$error":"#N/A"}},{"$error":"#N/A"},{"$error":"#N/A"}]
[null,24,"f ",{"$f":"VLOOKUP($B25,'Runde 1'!$A$2:$C$97,3,0)","v":{"$error":"#N/A"}},{"$f":"VLOOKUP($B25,'Runde 2'!$A$2:$C$97,3,0)","v":{"$error":"#N/A"}},{"$f":"VLOOKUP($B25,'Runde 3'!$A$2:$C$97,3,0)","v":{"$error":"#N/A"}},{"$f":"VLOOKUP($B25,'Runde 4'!$A$2:$C$97,3,0)","v":{"$error":"#N/A"}},{"$f":"VLOOKUP($B25,'Runde 5'!$A$2:$C$97,3,0)","v":{"$error":"#N/A"}},{"$f":"VLOOKUP($B25,'Runde 6'!$A$2:$C$97,3,0)","v":{"$error":"#N/A"}},{"$f":"VLOOKUP($B25,'Runde 7'!$A$2:$C$97,3,0)","v":{"$error":"#N/A"}},{"$error":"#N/A"},{"$error":"#N/A"}]
[null,25,"g ",{"$f":"VLOOKUP($B26,'Runde 1'!$A$2:$C$97,3,0)","v":{"$error":"#N/A"}},{"$f":"VLOOKUP($B26,'Runde 2'!$A$2:$C$97,3,0)","v":{"$error":"#N/A"}},{"$f":"VLOOKUP($B26,'Runde 3'!$A$2:$C$97,3,0)","v":{"$error":"#N/A"}},{"$f":"VLOOKUP($B26,'Runde 4'!$A$2:$C$97,3,0)","v":{"$error":"#N/A"}},{"$f":"VLOOKUP($B26,'Runde 5'!$A$2:$C$97,3,0)","v":{"$error":"#N/A"}},{"$f":"VLOOKUP($B26,'Runde 6'!$A$2:$C$97,3,0)","v":{"$error":"#N/A"}},{"$f":"VLOOKUP($B26,'Runde 7'!$A$2:$C$97,3,0)","v":{"$error":"#N/A"}},{"$error":"#N/A"},{"$error":"#N/A"}]
[null,26,"h ",{"$f":"VLOOKUP($B27,'Runde 1'!$A$2:$C$97,3,0)","v":{"$error":"#N/A"}},{"$f":"VLOOKUP($B27,'Runde 2'!$A$2:$C$97,3,0)","v":{"$error":"#N/A"}},{"$f":"VLOOKUP($B27,'Runde 3'!$A$2:$C$97,3,0)","v":{"$error":"#N/A"}},{"$f":"VLOOKUP($B27,'Runde 4'!$A$2:$C$97,3,0)","v":{"$error":"#N/A"}},{"$f":"VLOOKUP($B27,'Runde 5'!$A$2:$C$97,3,0)","v":{"$error":"#N/A"}},{"$f":"VLOOKUP($B27,'Runde 6'!$A$2:$C$97,3,0)","v":{"$error":"#N/A"}},{"$f":"VLOOKUP($B27,'Runde 7'!$A$2:$C$97,3,0)","v":{"$error":"#N/A"}},{"$error":"#N/A"},{"$error":"#N/A"}]
[null,27,"i ",{"$f":"VLOOKUP($B28,'Runde 1'!$A$2:$C$97,3,0)","v":{"$error":"#N/A"}},{"$f":"VLOOKUP($B28,'Runde 2'!$A$2:$C$97,3,0)","v":{"$error":"#N/A"}},{"$f":"VLOOKUP($B28,'Runde 3'!$A$2:$C$97,3,0)","v":{"$error":"#N/A"}},{"$f":"VLOOKUP($B28,'Runde 4'!$A$2:$C$97,3,0)","v":{"$error":"#N/A"}},{"$f":"VLOOKUP($B28,'Runde 5'!$A$2:$C$97,3,0)","v":{"$error":"#N/A"}},{"$f":"VLOOKUP($B28,'Runde 6'!$A$2:$C$97,3,0)","v":{"$error":"#N/A"}},{"$f":"VLOOKUP($B28,'Runde 7'!$A$2:$C$97,3,0)","v":{"$error":"#N/A"}},{"$error":"#N/A"},{"$error":"#N/A"}]
[null,28,"j ",{"$f":"VLOOKUP($B29,'Runde 1'!$A$2:$C$97,3,0)","v":{"$error":"#N/A"}},{"$f":"VLOOKUP($B29,'Runde 2'!$A$2:$C$97,3,0)","v":{"$error":"#N/A"}},{"$f":"VLOOKUP($B29,'Runde 3'!$A$2:$C$97,3,0)","v":{"$error":"#N/A"}},{"$f":"VLOOKUP($B29,'Runde 4'!$A$2:$C$97,3,0)","v":{"$error":"#N/A"}},{"$f":"VLOOKUP($B29,'Runde 5'!$A$2:$C$97,3,0)","v":{"$error":"#N/A"}},{"$f":"VLOOKUP($B29,'Runde 6'!$A$2:$C$97,3,0)","v":{"$error":"#N/A"}},{"$f":"VLOOKUP($B29,'Runde 7'!$A$2:$C$97,3,0)","v":{"$error":"#N/A"}},{"$error":"#N/A"},{"$error":"#N/A"}]
[null,29,"k ",{"$f":"VLOOKUP($B30,'Runde 1'!$A$2:$C$97,3,0)","v":{"$error":"#N/A"}},{"$f":"VLOOKUP($B30,'Runde 2'!$A$2:$C$97,3,0)","v":{"$error":"#N/A"}},{"$f":"VLOOKUP($B30,'Runde 3'!$A$2:$C$97,3,0)","v":{"$error":"#N/A"}},{"$f":"VLOOKUP($B30,'Runde 4'!$A$2:$C$97,3,0)","v":{"$error":"#N/A"}},{"$f":"VLOOKUP($B30,'Runde 5'!$A$2:$C$97,3,0)","v":{"$error":"#N/A"}},{"$f":"VLOOKUP($B30,'Runde 6'!$A$2:$C$97,3,0)","v":{"$error":"#N/A"}},{"$f":"VLOOKUP($B30,'Runde 7'!$A$2:$C$97,3,0)","v":{"$error":"#N/A"}},{"$error":"#N/A"},{"$error":"#N/A"}]
[null,30,"l ",{"$f":"VLOOKUP($B31,'Runde 1'!$A$2:$C$97,3,0)","v":{"$error":"#N/A"}},{"$f":"VLOOKUP($B31,'Runde 2'!$A$2:$C$97,3,0)","v":{"$error":"#N/A"}},{"$f":"VLOOKUP($B31,'Runde 3'!$A$2:$C$97,3,0)","v":{"$error":"#N/A"}},{"$f":"VLOOKUP($B31,'Runde 4'!$A$2:$C$97,3,0)","v":{"$error":"#N/A"}},{"$f":"VLOOKUP($B31,'Runde 5'!$A$2:$C$97,3,0)","v":{"$error":"#N/A"}},{"$f":"VLOOKUP($B31,'Runde 6'!$A$2:$C$97,3,0)","v":{"$error":"#N/A"}},{"$f":"VLOOKUP($B31,'Runde 7'!$A$2:$C$97,3,0)","v":{"$error":"#N/A"}},{"$error":"#N/A"},{"$error":"#N/A"}]
[null,31,"m ",{"$f":"VLOOKUP($B32,'Runde 1'!$A$2:$C$97,3,0)","v":{"$error":"#N/A"}},{"$f":"VLOOKUP($B32,'Runde 2'!$A$2:$C$97,3,0)","v":{"$error":"#N/A"}},{"$f":"VLOOKUP($B32,'Runde 3'!$A$2:$C$97,3,0)","v":{"$error":"#N/A"}},{"$f":"VLOOKUP($B32,'Runde 4'!$A$2:$C$97,3,0)","v":{"$error":"#N/A"}},{"$f":"VLOOKUP($B32,'Runde 5'!$A$2:$C$97,3,0)","v":{"$error":"#N/A"}},{"$f":"VLOOKUP($B32,'Runde 6'!$A$2:$C$97,3,0)","v":{"$error":"#N/A"}},{"$f":"VLOOKUP($B32,'Runde 7'!$A$2:$C$97,3,0)","v":{"$error":"#N/A"}},{"$error":"#N/A"},{"$error":"#N/A"}]
[null,32,"n ",{"$f":"VLOOKUP($B33,'Runde 1'!$A$2:$C$97,3,0)","v":{"$error":"#N/A"}},{"$f":"VLOOKUP($B33,'Runde 2'!$A$2:$C$97,3,0)","v":{"$error":"#N/A"}},{"$f":"VLOOKUP($B33,'Runde 3'!$A$2:$C$97,3,0)","v":{"$error":"#N/A"}},{"$f":"VLOOKUP($B33,'Runde 4'!$A$2:$C$97,3,0)","v":{"$error":"#N/A"}},{"$f":"VLOOKUP($B33,'Runde 5'!$A$2:$C$97,3,0)","v":{"$error":"#N/A"}},{"$f":"VLOOKUP($B33,'Runde 6'!$A$2:$C$97,3,0)","v":{"$error":"#N/A"}},{"$f":"VLOOKUP($B33,'Runde 7'!$A$2:$C$97,3,0)","v":{"$error":"#N/A"}},{"$error":"#N/A"},{"$error":"#N/A"}]
[null,33,"o ",{"$f":"VLOOKUP($B34,'Runde 1'!$A$2:$C$97,3,0)","v":{"$error":"#N/A"}},{"$f":"VLOOKUP($B34,'Runde 2'!$A$2:$C$97,3,0)","v":{"$error":"#N/A"}},{"$f":"VLOOKUP($B34,'Runde 3'!$A$2:$C$97,3,0)","v":{"$error":"#N/A"}},{"$f":"VLOOKUP($B34,'Runde 4'!$A$2:$C$97,3,0)","v":{"$error":"#N/A"}},{"$f":"VLOOKUP($B34,'Runde 5'!$A$2:$C$97,3,0)","v":{"$error":"#N/A"}},{"$f":"VLOOKUP($B34,'Runde 6'!$A$2:$C$97,3,0)","v":{"$error":"#N/A"}},{"$f":"VLOOKUP($B34,'Runde 7'!$A$2:$C$97,3,0)","v":{"$error":"#N/A"}},{"$error":"#N/A"},{"$error":"#N/A"}]
[null,34,"p ",{"$f":"VLOOKUP($B35,'Runde 1'!$A$2:$C$97,3,0)","v":{"$error":"#N/A"}},{"$f":"VLOOKUP($B35,'Runde 2'!$A$2:$C$97,3,0)","v":{"$error":"#N/A"}},{"$f":"VLOOKUP($B35,'Runde 3'!$A$2:$C$97,3,0)","v":{"$error":"#N/A"}},{"$f":"VLOOKUP($B35,'Runde 4'!$A$2:$C$97,3,0)","v":{"$error":"#N/A"}},{"$f":"VLOOKUP($B35,'Runde 5'!$A$2:$C$97,3,0)","v":{"$error":"#N/A"}},{"$f":"VLOOKUP($B35,'Runde 6'!$A$2:$C$97,3,0)","v":{"$error":"#N/A"}},{"$f":"VLOOKUP($B35,'Runde 7'!$A$2:$C$97,3,0)","v":{"$error":"#N/A"}},{"$error":"#N/A"},{"$error":"#N/A"}]
[null,35,"q ",{"$f":"VLOOKUP($B36,'Runde 1'!$A$2:$C$97,3,0)","v":{"$error":"#N/A"}},{"$f":"VLOOKUP($B36,'Runde 2'!$A$2:$C$97,3,0)","v":{"$error":"#N/A"}},{"$f":"VLOOKUP($B36,'Runde 3'!$A$2:$C$97,3,0)","v":{"$error":"#N/A"}},{"$f":"VLOOKUP($B36,'Runde 4'!$A$2:$C$97,3,0)","v":{"$error":"#N/A"}},{"$f":"VLOOKUP($B36,'Runde 5'!$A$2:$C$97,3,0)","v":{"$error":"#N/A"}},{"$f":"VLOOKUP($B36,'Runde 6'!$A$2:$C$97,3,0)","v":{"$error":"#N/A"}},{"$f":"VLOOKUP($B36,'Runde 7'!$A$2:$C$97,3,0)","v":{"$error":"#N/A"}},{"$error":"#N/A"},{"$error":"#N/A"}]
[null,36,"r ",{"$f":"VLOOKUP($B37,'Runde 1'!$A$2:$C$97,3,0)","v":{"$error":"#N/A"}},{"$f":"VLOOKUP($B37,'Runde 2'!$A$2:$C$97,3,0)","v":{"$error":"#N/A"}},{"$f":"VLOOKUP($B37,'Runde 3'!$A$2:$C$97,3,0)","v":{"$error":"#N/A"}},{"$f":"VLOOKUP($B37,'Runde 4'!$A$2:$C$97,3,0)","v":{"$error":"#N/A"}},{"$f":"VLOOKUP($B37,'Runde 5'!$A$2:$C$97,3,0)","v":{"$error":"#N/A"}},{"$f":"VLOOKUP($B37,'Runde 6'!$A$2:$C$97,3,0)","v":{"$error":"#N/A"}},{"$f":"VLOOKUP($B37,'Runde 7'!$A$2:$C$97,3,0)","v":{"$error":"#N/A"}},{"$error":"#N/A"},{"$error":"#N/A"}]
[null,37,"s ",{"$f":"VLOOKUP($B38,'Runde 1'!$A$2:$C$97,3,0)","v":{"$error":"#N/A"}},{"$f":"VLOOKUP($B38,'Runde 2'!$A$2:$C$97,3,0)","v":{"$error":"#N/A"}},{"$f":"VLOOKUP($B38,'Runde 3'!$A$2:$C$97,3,0)","v":{"$error":"#N/A"}},{"$f":"VLOOKUP($B38,'Runde 4'!$A$2:$C$97,3,0)","v":{"$error":"#N/A"}},{"$f":"VLOOKUP($B38,'Runde 5'!$A$2:$C$97,3,0)","v":{"$error":"#N/A"}},{"$f":"VLOOKUP($B38,'Runde 6'!$A$2:$C$97,3,0)","v":{"$error":"#N/A"}},{"$f":"VLOOKUP($B38,'Runde 7'!$A$2:$C$97,3,0)","v":{"$error":"#N/A"}},{"$error":"#N/A"},{"$error":"#N/A"}]
[null,38,"t ",{"$f":"VLOOKUP($B39,'Runde 1'!$A$2:$C$97,3,0)","v":{"$error":"#N/A"}},{"$f":"VLOOKUP($B39,'Runde 2'!$A$2:$C$97,3,0)","v":{"$error":"#N/A"}},{"$f":"VLOOKUP($B39,'Runde 3'!$A$2:$C$97,3,0)","v":{"$error":"#N/A"}},{"$f":"VLOOKUP($B39,'Runde 4'!$A$2:$C$97,3,0)","v":{"$error":"#N/A"}},{"$f":"VLOOKUP($B39,'Runde 5'!$A$2:$C$97,3,0)","v":{"$error":"#N/A"}},{"$f":"VLOOKUP($B39,'Runde 6'!$A$2:$C$97,3,0)","v":{"$error":"#N/A"}},{"$f":"VLOOKUP($B39,'Runde 7'!$A$2:$C$97,3,0)","v":{"$error":"#N/A"}},{"$error":"#N/A"},{"$error":"#N/A"}]
[null,39,"u",{"$f":"VLOOKUP($B40,'Runde 1'!$A$2:$C$97,3,0)","v":{"$error":"#N/A"}},{"$f":"VLOOKUP($B40,'Runde 2'!$A$2:$C$97,3,0)","v":{"$error":"#N/A"}},{"$f":"VLOOKUP($B40,'Runde 3'!$A$2:$C$97,3,0)","v":{"$error":"#N/A"}},{"$f":"VLOOKUP($B40,'Runde 4'!$A$2:$C$97,3,0)","v":{"$error":"#N/A"}},{"$f":"VLOOKUP($B40,'Runde 5'!$A$2:$C$97,3,0)","v":{"$error":"#N/A"}},{"$f":"VLOOKUP($B40,'Runde 6'!$A$2:$C$97,3,0)","v":{"$error":"#N/A"}},{"$f":"VLOOKUP($B40,'Runde 7'!$A$2:$C$97,3,0)","v":{"$error":"#N/A"}},{"$error":"#N/A"},{"$error":"#N/A"}]
[null,40,"v",{"$f":"VLOOKUP($B41,'Runde 1'!$A$2:$C$97,3,0)","v":{"$error":"#N/A"}},{"$f":"VLOOKUP($B41,'Runde 2'!$A$2:$C$97,3,0)","v":{"$error":"#N/A"}},{"$f":"VLOOKUP($B41,'Runde 3'!$A$2:$C$97,3,0)","v":{"$error":"#N/A"}},{"$f":"VLOOKUP($B41,'Runde 4'!$A$2:$C$97,3,0)","v":{"$error":"#N/A"}},{"$f":"VLOOKUP($B41,'Runde 5'!$A$2:$C$97,3,0)","v":{"$error":"#N/A"}},{"$f":"VLOOKUP($B41,'Runde 6'!$A$2:$C$97,3,0)","v":{"$error":"#N/A"}},{"$f":"VLOOKUP($B41,'Runde 7'!$A$2:$C$97,3,0)","v":{"$error":"#N/A"}},{"$error":"#N/A"},{"$error":"#N/A"}]
[null,41,null,{"$f":"VLOOKUP($B42,'Runde 1'!$A$2:$C$97,3,0)","v":{"$error":"#N/A"}},{"$f":"VLOOKUP($B42,'Runde 2'!$A$2:$C$97,3,0)","v":{"$error":"#N/A"}},{"$f":"VLOOKUP($B42,'Runde 3'!$A$2:$C$97,3,0)","v":{"$error":"#N/A"}},{"$f":"VLOOKUP($B42,'Runde 4'!$A$2:$C$97,3,0)","v":{"$error":"#N/A"}},{"$f":"VLOOKUP($B42,'Runde 5'!$A$2:$C$97,3,0)","v":{"$error":"#N/A"}},{"$f":"VLOOKUP($B42,'Runde 6'!$A$2:$C$97,3,0)","v":{"$error":"#N/A"}},{"$f":"VLOOKUP($B42,'Runde 7'!$A$2:$C$97,3,0)","v":{"$error":"#N/A"}},{"$error":"#N/A"}]
[null,42,null,{"$f":"VLOOKUP($B43,'Runde 1'!$A$2:$C$97,3,0)","v":{"$error":"#N/A"}},{"$f":"VLOOKUP($B43,'Runde 2'!$A$2:$C$97,3,0)","v":{"$error":"#N/A"}},{"$f":"VLOOKUP($B43,'Runde 3'!$A$2:$C$97,3,0)","v":{"$error":"#N/A"}},{"$f":"VLOOKUP($B43,'Runde 4'!$A$2:$C$97,3,0)","v":{"$error":"#N/A"}},{"$f":"VLOOKUP($B43,'Runde 5'!$A$2:$C$97,3,0)","v":{"$error":"#N/A"}},{"$f":"VLOOKUP($B43,'Runde 6'!$A$2:$C$97,3,0)","v":{"$error":"#N/A"}},{"$f":"VLOOKUP($B43,'Runde 7'!$A$2:$C$97,3,0)","v":{"$error":"#N/A"}},{"$error":"#N/A"}]
[null,43,null,{"$f":"VLOOKUP($B44,'Runde 1'!$A$2:$C$97,3,0)","v":{"$error":"#N/A"}},{"$f":"VLOOKUP($B44,'Runde 2'!$A$2:$C$97,3,0)","v":{"$error":"#N/A"}},{"$f":"VLOOKUP($B44,'Runde 3'!$A$2:$C$97,3,0)","v":{"$error":"#N/A"}},{"$f":"VLOOKUP($B44,'Runde 4'!$A$2:$C$97,3,0)","v":{"$error":"#N/A"}},{"$f":"VLOOKUP($B44,'Runde 5'!$A$2:$C$97,3,0)","v":{"$error":"#N/A"}},{"$f":"VLOOKUP($B44,'Runde 6'!$A$2:$C$97,3,0)","v":{"$error":"#N/A"}},{"$f":"VLOOKUP($B44,'Runde 7'!$A$2:$C$97,3,0)","v":{"$error":"#N/A"}},{"$error":"#N/A"}]
[null,44,null,{"$f":"VLOOKUP($B45,'Runde 1'!$A$2:$C$97,3,0)","v":{"$error":"#N/A"}},{"$f":"VLOOKUP($B45,'Runde 2'!$A$2:$C$97,3,0)","v":{"$error":"#N/A"}},{"$f":"VLOOKUP($B45,'Runde 3'!$A$2:$C$97,3,0)","v":{"$error":"#N/A"}},{"$f":"VLOOKUP($B45,'Runde 4'!$A$2:$C$97,3,0)","v":{"$error":"#N/A"}},{"$f":"VLOOKUP($B45,'Runde 5'!$A$2:$C$97,3,0)","v":{"$error":"#N/A"}},{"$f":"VLOOKUP($B45,'Runde 6'!$A$2:$C$97,3,0)","v":{"$error":"#N/A"}},{"$f":"VLOOKUP($B45,'Runde 7'!$A$2:$C$97,3,0)","v":{"$error":"#N/A"}},{"$error":"#N/A"}]
[null,45,null,{"$f":"VLOOKUP($B46,'Runde 1'!$A$2:$C$97,3,0)","v":{"$error":"#N/A"}},{"$f":"VLOOKUP($B46,'Runde 2'!$A$2:$C$97,3,0)","v":{"$error":"#N/A"}},{"$f":"VLOOKUP($B46,'Runde 3'!$A$2:$C$97,3,0)","v":{"$error":"#N/A"}},{"$f":"VLOOKUP($B46,'Runde 4'!$A$2:$C$97,3,0)","v":{"$error":"#N/A"}},{"$f":"VLOOKUP($B46,'Runde 5'!$A$2:$C$97,3,0)","v":{"$error":"#N/A"}},{"$f":"VLOOKUP($B46,'Runde 6'!$A$2:$C$97,3,0)","v":{"$error":"#N/A"}},{"$f":"VLOOKUP($B46,'Runde 7'!$A$2:$C$97,3,0)","v":{"$error":"#N/A"}},{"$error":"#N/A"}]
[null,46,null,{"$f":"VLOOKUP($B47,'Runde 1'!$A$2:$C$97,3,0)","v":{"$error":"#N/A"}},{"$f":"VLOOKUP($B47,'Runde 2'!$A$2:$C$97,3,0)","v":{"$error":"#N/A"}},{"$f":"VLOOKUP($B47,'Runde 3'!$A$2:$C$97,3,0)","v":{"$error":"#N/A"}},{"$f":"VLOOKUP($B47,'Runde 4'!$A$2:$C$97,3,0)","v":{"$error":"#N/A"}},{"$f":"VLOOKUP($B47,'Runde 5'!$A$2:$C$97,3,0)","v":{"$error":"#N/A"}},{"$f":"VLOOKUP($B47,'Runde 6'!$A$2:$C$97,3,0)","v":{"$error":"#N/A"}},{"$f":"VLOOKUP($B47,'Runde 7'!$A$2:$C$97,3,0)","v":{"$error":"#N/A"}},{"$error":"#N/A"}]
[null,47,null,{"$f":"VLOOKUP($B48,'Runde 1'!$A$2:$C$97,3,0)","v":{"$error":"#N/A"}},{"$f":"VLOOKUP($B48,'Runde 2'!$A$2:$C$97,3,0)","v":{"$error":"#N/A"}},{"$f":"VLOOKUP($B48,'Runde 3'!$A$2:$C$97,3,0)","v":{"$error":"#N/A"}},{"$f":"VLOOKUP($B48,'Runde 4'!$A$2:$C$97,3,0)","v":{"$error":"#N/A"}},{"$f":"VLOOKUP($B48,'Runde 5'!$A$2:$C$97,3,0)","v":{"$error":"#N/A"}},{"$f":"VLOOKUP($B48,'Runde 6'!$A$2:$C$97,3,0)","v":{"$error":"#N/A"}},{"$f":"VLOOKUP($B48,'Runde 7'!$A$2:$C$97,3,0)","v":{"$error":"#N/A"}},{"$error":"#N/A"}]
[null,48,null,{"$f":"VLOOKUP($B49,'Runde 1'!$A$2:$C$97,3,0)","v":{"$error":"#N/A"}},{"$f":"VLOOKUP($B49,'Runde 2'!$A$2:$C$97,3,0)","v":{"$error":"#N/A"}},{"$f":"VLOOKUP($B49,'Runde 3'!$A$2:$C$97,3,0)","v":{"$error":"#N/A"}},{"$f":"VLOOKUP($B49,'Runde 4'!$A$2:$C$97,3,0)","v":{"$error":"#N/A"}},{"$f":"VLOOKUP($B49,'Runde 5'!$A$2:$C$97,3,0)","v":{"$error":"#N/A"}},{"$f":"VLOOKUP($B49,'Runde 6'!$A$2:$C$97,3,0)","v":{"$error":"#N/A"}},{"$f":"VLOOKUP($B49,'Runde 7'!$A$2:$C$97,3,0)","v":{"$error":"#N/A"}},{"$error":"#N/A"}]
[null,49,null,{"$f":"VLOOKUP($B50,'Runde 1'!$A$2:$C$97,3,0)","v":{"$error":"#N/A"}},{"$f":"VLOOKUP($B50,'Runde 2'!$A$2:$C$97,3,0)","v":{"$error":"#N/A"}},{"$f":"VLOOKUP($B50,'Runde 3'!$A$2:$C$97,3,0)","v":{"$error":"#N/A"}},{"$f":"VLOOKUP($B50,'Runde 4'!$A$2:$C$97,3,0)","v":{"$error":"#N/A"}},{"$f":"VLOOKUP($B50,'Runde 5'!$A$2:$C$97,3,0)","v":{"$error":"#N/A"}},{"$f":"VLOOKUP($B50,'Runde 6'!$A$2:$C$97,3,0)","v":{"$error":"#N/A"}},{"$f":"VLOOKUP($B50,'Runde 7'!$A$2:$C$97,3,0)","v":{"$error":"#N/A"}},{"$error":"#N/A"}]
[null,50,null,{"$f":"VLOOKUP($B51,'Runde 1'!$A$2:$C$97,3,0)","v":{"$error":"#N/A"}},{"$f":"VLOOKUP($B51,'Runde 2'!$A$2:$C$97,3,0)","v":{"$error":"#N/A"}},{"$f":"VLOOKUP($B51,'Runde 3'!$A$2:$C$97,3,0)","v":{"$error":"#N/A"}},{"$f":"VLOOKUP($B51,'Runde 4'!$A$2:$C$97,3,0)","v":{"$error":"#N/A"}},{"$f":"VLOOKUP($B51,'Runde 5'!$A$2:$C$97,3,0)","v":{"$error":"#N/A"}},{"$f":"VLOOKUP($B51,'Runde 6'!$A$2:$C$97,3,0)","v":{"$error":"#N/A"}},{"$f":"VLOOKUP($B51,'Runde 7'!$A$2:$C$97,3,0)","v":{"$error":"#N/A"}},{"$error":"#N/A"}]
[null,51,null,{"$f":"VLOOKUP($B52,'Runde 1'!$A$2:$C$97,3,0)","v":{"$error":"#N/A"}},{"$f":"VLOOKUP($B52,'Runde 2'!$A$2:$C$97,3,0)","v":{"$error":"#N/A"}},{"$f":"VLOOKUP($B52,'Runde 3'!$A$2:$C$97,3,0)","v":{"$error":"#N/A"}},{"$f":"VLOOKUP($B52,'Runde 4'!$A$2:$C$97,3,0)","v":{"$error":"#N/A"}},{"$f":"VLOOKUP($B52,'Runde 5'!$A$2:$C$97,3,0)","v":{"$error":"#N/A"}},{"$f":"VLOOKUP($B52,'Runde 6'!$A$2:$C$97,3,0)","v":{"$error":"#N/A"}},{"$f":"VLOOKUP($B52,'Runde 7'!$A$2:$C$97,3,0)","v":{"$error":"#N/A"}},{"$error":"#N/A"}]
[null,52,null,{"$f":"VLOOKUP($B53,'Runde 1'!$A$2:$C$97,3,0)","v":{"$error":"#N/A"}},{"$f":"VLOOKUP($B53,'Runde 2'!$A$2:$C$97,3,0)","v":{"$error":"#N/A"}},{"$f":"VLOOKUP($B53,'Runde 3'!$A$2:$C$97,3,0)","v":{"$error":"#N/A"}},{"$f":"VLOOKUP($B53,'Runde 4'!$A$2:$C$97,3,0)","v":{"$error":"#N/A"}},{"$f":"VLOOKUP($B53,'Runde 5'!$A$2:$C$97,3,0)","v":{"$error":"#N/A"}},{"$f":"VLOOKUP($B53,'Runde 6'!$A$2:$C$97,3,0)","v":{"$error":"#N/A"}},{"$f":"VLOOKUP($B53,'Runde 7'!$A$2:$C$97,3,0)","v":{"$error":"#N/A"}},{"$error":"#N/A"}]
[null,53,null,{"$f":"VLOOKUP($B54,'Runde 1'!$A$2:$C$97,3,0)","v":{"$error":"#N/A"}},{"$f":"VLOOKUP($B54,'Runde 2'!$A$2:$C$97,3,0)","v":{"$error":"#N/A"}},{"$f":"VLOOKUP($B54,'Runde 3'!$A$2:$C$97,3,0)","v":{"$error":"#N/A"}},{"$f":"VLOOKUP($B54,'Runde 4'!$A$2:$C$97,3,0)","v":{"$error":"#N/A"}},{"$f":"VLOOKUP($B54,'Runde 5'!$A$2:$C$97,3,0)","v":{"$error":"#N/A"}},{"$f":"VLOOKUP($B54,'Runde 6'!$A$2:$C$97,3,0)","v":{"$error":"#N/A"}},{"$f":"VLOOKUP($B54,'Runde 7'!$A$2:$C$97,3,0)","v":{"$error":"#N/A"}},{"$error":"#N/A"}]
[null,54,null,{"$f":"VLOOKUP($B55,'Runde 1'!$A$2:$C$97,3,0)","v":{"$error":"#N/A"}},{"$f":"VLOOKUP($B55,'Runde 2'!$A$2:$C$97,3,0)","v":{"$error":"#N/A"}},{"$f":"VLOOKUP($B55,'Runde 3'!$A$2:$C$97,3,0)","v":{"$error":"#N/A"}},{"$f":"VLOOKUP($B55,'Runde 4'!$A$2:$C$97,3,0)","v":{"$error":"#N/A"}},{"$f":"VLOOKUP($B55,'Runde 5'!$A$2:$C$97,3,0)","v":{"$error":"#N/A"}},{"$f":"VLOOKUP($B55,'Runde 6'!$A$2:$C$97,3,0)","v":{"$error":"#N/A"}},{"$f":"VLOOKUP($B55,'Runde 7'!$A$2:$C$97,3,0)","v":{"$error":"#N/A"}},{"$error":"#N/A"}]
[null,55,null,{"$f":"VLOOKUP($B56,'Runde 1'!$A$2:$C$97,3,0)","v":{"$error":"#N/A"}},{"$f":"VLOOKUP($B56,'Runde 2'!$A$2:$C$97,3,0)","v":{"$error":"#N/A"}},{"$f":"VLOOKUP($B56,'Runde 3'!$A$2:$C$97,3,0)","v":{"$error":"#N/A"}},{"$f":"VLOOKUP($B56,'Runde 4'!$A$2:$C$97,3,0)","v":{"$error":"#N/A"}},{"$f":"VLOOKUP($B56,'Runde 5'!$A$2:$C$97,3,0)","v":{"$error":"#N/A"}},{"$f":"VLOOKUP($B56,'Runde 6'!$A$2:$C$97,3,0)","v":{"$error":"#N/A"}},{"$f":"VLOOKUP($B56,'Runde 7'!$A$2:$C$97,3,0)","v":{"$error":"#N/A"}},{"$error":"#N/A"}]
[null,56,null,{"$f":"VLOOKUP($B57,'Runde 1'!$A$2:$C$97,3,0)","v":{"$error":"#N/A"}},{"$f":"VLOOKUP($B57,'Runde 2'!$A$2:$C$97,3,0)","v":{"$error":"#N/A"}},{"$f":"VLOOKUP($B57,'Runde 3'!$A$2:$C$97,3,0)","v":{"$error":"#N/A"}},{"$f":"VLOOKUP($B57,'Runde 4'!$A$2:$C$97,3,0)","v":{"$error":"#N/A"}},{"$f":"VLOOKUP($B57,'Runde 5'!$A$2:$C$97,3,0)","v":{"$error":"#N/A"}},{"$f":"VLOOKUP($B57,'Runde 6'!$A$2:$C$97,3,0)","v":{"$error":"#N/A"}},{"$f":"VLOOKUP($B57,'Runde 7'!$A$2:$C$97,3,0)","v":{"$error":"#N/A"}},{"$error":"#N/A"}]
[null,57,null,{"$f":"VLOOKUP($B58,'Runde 1'!$A$2:$C$97,3,0)","v":{"$error":"#N/A"}},{"$f":"VLOOKUP($B58,'Runde 2'!$A$2:$C$97,3,0)","v":{"$error":"#N/A"}},{"$f":"VLOOKUP($B58,'Runde 3'!$A$2:$C$97,3,0)","v":{"$error":"#N/A"}},{"$f":"VLOOKUP($B58,'Runde 4'!$A$2:$C$97,3,0)","v":{"$error":"#N/A"}},{"$f":"VLOOKUP($B58,'Runde 5'!$A$2:$C$97,3,0)","v":{"$error":"#N/A"}},{"$f":"VLOOKUP($B58,'Runde 6'!$A$2:$C$97,3,0)","v":{"$error":"#N/A"}},{"$f":"VLOOKUP($B58,'Runde 7'!$A$2:$C$97,3,0)","v":{"$error":"#N/A"}},{"$error":"#N/A"}]
[null,58,null,{"$f":"VLOOKUP($B59,'Runde 1'!$A$2:$C$97,3,0)","v":{"$error":"#N/A"}},{"$f":"VLOOKUP($B59,'Runde 2'!$A$2:$C$97,3,0)","v":{"$error":"#N/A"}},{"$f":"VLOOKUP($B59,'Runde 3'!$A$2:$C$97,3,0)","v":{"$error":"#N/A"}},{"$f":"VLOOKUP($B59,'Runde 4'!$A$2:$C$97,3,0)","v":{"$error":"#N/A"}},{"$f":"VLOOKUP($B59,'Runde 5'!$A$2:$C$97,3,0)","v":{"$error":"#N/A"}},{"$f":"VLOOKUP($B59,'Runde 6'!$A$2:$C$97,3,0)","v":{"$error":"#N/A"}},{"$f":"VLOOKUP($B59,'Runde 7'!$A$2:$C$97,3,0)","v":{"$error":"#N/A"}},{"$error":"#N/A"}]
[null,59,null,{"$f":"VLOOKUP($B60,'Runde 1'!$A$2:$C$97,3,0)","v":{"$error":"#N/A"}},{"$f":"VLOOKUP($B60,'Runde 2'!$A$2:$C$97,3,0)","v":{"$error":"#N/A"}},{"$f":"VLOOKUP($B60,'Runde 3'!$A$2:$C$97,3,0)","v":{"$error":"#N/A"}},{"$f":"VLOOKUP($B60,'Runde 4'!$A$2:$C$97,3,0)","v":{"$error":"#N/A"}},{"$f":"VLOOKUP($B60,'Runde 5'!$A$2:$C$97,3,0)","v":{"$error":"#N/A"}},{"$f":"VLOOKUP($B60,'Runde 6'!$A$2:$C$97,3,0)","v":{"$error":"#N/A"}},{"$f":"VLOOKUP($B60,'Runde 7'!$A$2:$C$97,3,0)","v":{"$error":"#N/A"}},{"$error":"#N/A"}]
[null,60,null,{"$f":"VLOOKUP($B61,'Runde 1'!$A$2:$C$97,3,0)","v":{"$error":"#N/A"}},{"$f":"VLOOKUP($B61,'Runde 2'!$A$2:$C$97,3,0)","v":{"$error":"#N/A"}},{"$f":"VLOOKUP($B61,'Runde 3'!$A$2:$C$97,3,0)","v":{"$error":"#N/A"}},{"$f":"VLOOKUP($B61,'Runde 4'!$A$2:$C$97,3,0)","v":{"$error":"#N/A"}},{"$f":"VLOOKUP($B61,'Runde 5'!$A$2:$C$97,3,0)","v":{"$error":"#N/A"}},{"$f":"VLOOKUP($B61,'Runde 6'!$A$2:$C$97,3,0)","v":{"$error":"#N/A"}},{"$f":"VLOOKUP($B61,'Runde 7'!$A$2:$C$97,3,0)","v":{"$error":"#N/A"}},{"$error":"#N/A"}]
[null,61,null,{"$f":"VLOOKUP($B62,'Runde 1'!$A$2:$C$97,3,0)","v":{"$error":"#N/A"}},{"$f":"VLOOKUP($B62,'Runde 2'!$A$2:$C$97,3,0)","v":{"$error":"#N/A"}},{"$f":"VLOOKUP($B62,'Runde 3'!$A$2:$C$97,3,0)","v":{"$error":"#N/A"}},{"$f":"VLOOKUP($B62,'Runde 4'!$A$2:$C$97,3,0)","v":{"$error":"#N/A"}},{"$f":"VLOOKUP($B62,'Runde 5'!$A$2:$C$97,3,0)","v":{"$error":"#N/A"}},{"$f":"VLOOKUP($B62,'Runde 6'!$A$2:$C$97,3,0)","v":{"$error":"#N/A"}},{"$f":"VLOOKUP($B62,'Runde 7'!$A$2:$C$97,3,0)","v":{"$error":"#N/A"}},{"$error":"#N/A"}]
[null,62,null,{"$f":"VLOOKUP($B63,'Runde 1'!$A$2:$C$97,3,0)","v":{"$error":"#N/A"}},{"$f":"VLOOKUP($B63,'Runde 2'!$A$2:$C$97,3,0)","v":{"$error":"#N/A"}},{"$f":"VLOOKUP($B63,'Runde 3'!$A$2:$C$97,3,0)","v":{"$error":"#N/A"}},{"$f":"VLOOKUP($B63,'Runde 4'!$A$2:$C$97,3,0)","v":{"$error":"#N/A"}},{"$f":"VLOOKUP($B63,'Runde 5'!$A$2:$C$97,3,0)","v":{"$error":"#N/A"}},{"$f":"VLOOKUP($B63,'Runde 6'!$A$2:$C$97,3,0)","v":{"$error":"#N/A"}},{"$f":"VLOOKUP($B63,'Runde 7'!$A$2:$C$97,3,0)","v":{"$error":"#N/A"}},{"$error":"#N/A"}]
[null,63,null,{"$f":"VLOOKUP($B64,'Runde 1'!$A$2:$C$97,3,0)","v":{"$error":"#N/A"}},{"$f":"VLOOKUP($B64,'Runde 2'!$A$2:$C$97,3,0)","v":{"$error":"#N/A"}},{"$f":"VLOOKUP($B64,'Runde 3'!$A$2:$C$97,3,0)","v":{"$error":"#N/A"}},{"$f":"VLOOKUP($B64,'Runde 4'!$A$2:$C$97,3,0)","v":{"$error":"#N/A"}},{"$f":"VLOOKUP($B64,'Runde 5'!$A$2:$C$97,3,0)","v":{"$error":"#N/A"}},{"$f":"VLOOKUP($B64,'Runde 6'!$A$2:$C$97,3,0)","v":{"$error":"#N/A"}},{"$f":"VLOOKUP($B64,'Runde 7'!$A$2:$C$97,3,0)","v":{"$error":"#N/A"}},{"$error":"#N/A"}]
[null,64,null,{"$f":"VLOOKUP($B65,'Runde 1'!$A$2:$C$97,3,0)","v":{"$error":"#N/A"}},{"$f":"VLOOKUP($B65,'Runde 2'!$A$2:$C$97,3,0)","v":{"$error":"#N/A"}},{"$f":"VLOOKUP($B65,'Runde 3'!$A$2:$C$97,3,0)","v":{"$error":"#N/A"}},{"$f":"VLOOKUP($B65,'Runde 4'!$A$2:$C$97,3,0)","v":{"$error":"#N/A"}},{"$f":"VLOOKUP($B65,'Runde 5'!$A$2:$C$97,3,0)","v":{"$error":"#N/A"}},{"$f":"VLOOKUP($B65,'Runde 6'!$A$2:$C$97,3,0)","v":{"$error":"#N/A"}},{"$f":"VLOOKUP($B65,'Runde 7'!$A$2:$C$97,3,0)","v":{"$error":"#N/A"}},{"$error":"#N/A"}]
[null,65,null,{"$f":"VLOOKUP($B66,'Runde 1'!$A$2:$C$97,3,0)","v":{"$error":"#N/A"}},{"$f":"VLOOKUP($B66,'Runde 2'!$A$2:$C$97,3,0)","v":{"$error":"#N/A"}},{"$f":"VLOOKUP($B66,'Runde 3'!$A$2:$C$97,3,0)","v":{"$error":"#N/A"}},{"$f":"VLOOKUP($B66,'Runde 4'!$A$2:$C$97,3,0)","v":{"$error":"#N/A"}},{"$f":"VLOOKUP($B66,'Runde 5'!$A$2:$C$97,3,0)","v":{"$error":"#N/A"}},{"$f":"VLOOKUP($B66,'Runde 6'!$A$2:$C$97,3,0)","v":{"$error":"#N/A"}},{"$f":"VLOOKUP($B66,'Runde 7'!$A$2:$C$97,3,0)","v":{"$error":"#N/A"}},{"$error":"#N/A"}]
[null,66,null,{"$f":"VLOOKUP($B67,'Runde 1'!$A$2:$C$97,3,0)","v":{"$error":"#N/A"}},{"$f":"VLOOKUP($B67,'Runde 2'!$A$2:$C$97,3,0)","v":{"$error":"#N/A"}},{"$f":"VLOOKUP($B67,'Runde 3'!$A$2:$C$97,3,0)","v":{"$error":"#N/A"}},{"$f":"VLOOKUP($B67,'Runde 4'!$A$2:$C$97,3,0)","v":{"$error":"#N/A"}},{"$f":"VLOOKUP($B67,'Runde 5'!$A$2:$C$97,3,0)","v":{"$error":"#N/A"}},{"$f":"VLOOKUP($B67,'Runde 6'!$A$2:$C$97,3,0)","v":{"$error":"#N/A"}},{"$f":"VLOOKUP($B67,'Runde 7'!$A$2:$C$97,3,0)","v":{"$error":"#N/A"}},{"$f":"SUM(D67:J67)","v":{"$error":"#N/A"}}]
[null,67,null,{"$f":"VLOOKUP($B68,'Runde 1'!$A$2:$C$97,3,0)","v":{"$error":"#N/A"}},{"$f":"VLOOKUP($B68,'Runde 2'!$A$2:$C$97,3,0)","v":{"$error":"#N/A"}},{"$f":"VLOOKUP($B68,'Runde 3'!$A$2:$C$97,3,0)","v":{"$error":"#N/A"}},{"$f":"VLOOKUP($B68,'Runde 4'!$A$2:$C$97,3,0)","v":{"$error":"#N/A"}},{"$f":"VLOOKUP($B68,'Runde 5'!$A$2:$C$97,3,0)","v":{"$error":"#N/A"}},{"$f":"VLOOKUP($B68,'Runde 6'!$A$2:$C$97,3,0)","v":{"$error":"#N/A"}},{"$f":"VLOOKUP($B68,'Runde 7'!$A$2:$C$97,3,0)","v":{"$error":"#N/A"}},{"$error":"#N/A"}]
[null,68,null,{"$f":"VLOOKUP($B69,'Runde 1'!$A$2:$C$97,3,0)","v":{"$error":"#N/A"}},{"$f":"VLOOKUP($B69,'Runde 2'!$A$2:$C$97,3,0)","v":{"$error":"#N/A"}},{"$f":"VLOOKUP($B69,'Runde 3'!$A$2:$C$97,3,0)","v":{"$error":"#N/A"}},{"$f":"VLOOKUP($B69,'Runde 4'!$A$2:$C$97,3,0)","v":{"$error":"#N/A"}},{"$f":"VLOOKUP($B69,'Runde 5'!$A$2:$C$97,3,0)","v":{"$error":"#N/A"}},{"$f":"VLOOKUP($B69,'Runde 6'!$A$2:$C$97,3,0)","v":{"$error":"#N/A"}},{"$f":"VLOOKUP($B69,'Runde 7'!$A$2:$C$97,3,0)","v":{"$error":"#N/A"}},{"$error":"#N/A"}]
[null,69,null,{"$f":"VLOOKUP($B70,'Runde 1'!$A$2:$C$97,3,0)","v":{"$error":"#N/A"}},{"$f":"VLOOKUP($B70,'Runde 2'!$A$2:$C$97,3,0)","v":{"$error":"#N/A"}},{"$f":"VLOOKUP($B70,'Runde 3'!$A$2:$C$97,3,0)","v":{"$error":"#N/A"}},{"$f":"VLOOKUP($B70,'Runde 4'!$A$2:$C$97,3,0)","v":{"$error":"#N/A"}},{"$f":"VLOOKUP($B70,'Runde 5'!$A$2:$C$97,3,0)","v":{"$error":"#N/A"}},{"$f":"VLOOKUP($B70,'Runde 6'!$A$2:$C$97,3,0)","v":{"$error":"#N/A"}},{"$f":"VLOOKUP($B70,'Runde 7'!$A$2:$C$97,3,0)","v":{"$error":"#N/A"}},{"$error":"#N/A"}]
[null,70,null,{"$f":"VLOOKUP($B71,'Runde 1'!$A$2:$C$97,3,0)","v":{"$error":"#N/A"}},{"$f":"VLOOKUP($B71,'Runde 2'!$A$2:$C$97,3,0)","v":{"$error":"#N/A"}},{"$f":"VLOOKUP($B71,'Runde 3'!$A$2:$C$97,3,0)","v":{"$error":"#N/A"}},{"$f":"VLOOKUP($B71,'Runde 4'!$A$2:$C$97,3,0)","v":{"$error":"#N/A"}},{"$f":"VLOOKUP($B71,'Runde 5'!$A$2:$C$97,3,0)","v":{"$error":"#N/A"}},{"$f":"VLOOKUP($B71,'Runde 6'!$A$2:$C$97,3,0)","v":{"$error":"#N/A"}},{"$f":"VLOOKUP($B71,'Runde 7'!$A$2:$C$97,3,0)","v":{"$error":"#N/A"}},{"$error":"#N/A"}]
[null,71,null,{"$f":"VLOOKUP($B72,'Runde 1'!$A$2:$C$97,3,0)","v":{"$error":"#N/A"}},{"$f":"VLOOKUP($B72,'Runde 2'!$A$2:$C$97,3,0)","v":{"$error":"#N/A"}},{"$f":"VLOOKUP($B72,'Runde 3'!$A$2:$C$97,3,0)","v":{"$error":"#N/A"}},{"$f":"VLOOKUP($B72,'Runde 4'!$A$2:$C$97,3,0)","v":{"$error":"#N/A"}},{"$f":"VLOOKUP($B72,'Runde 5'!$A$2:$C$97,3,0)","v":{"$error":"#N/A"}},{"$f":"VLOOKUP($B72,'Runde 6'!$A$2:$C$97,3,0)","v":{"$error":"#N/A"}},{"$f":"VLOOKUP($B72,'Runde 7'!$A$2:$C$97,3,0)","v":{"$error":"#N/A"}},{"$error":"#N/A"}]
[null,72,null,{"$f":"VLOOKUP($B73,'Runde 1'!$A$2:$C$97,3,0)","v":{"$error":"#N/A"}},{"$f":"VLOOKUP($B73,'Runde 2'!$A$2:$C$97,3,0)","v":{"$error":"#N/A"}},{"$f":"VLOOKUP($B73,'Runde 3'!$A$2:$C$97,3,0)","v":{"$error":"#N/A"}},{"$f":"VLOOKUP($B73,'Runde 4'!$A$2:$C$97,3,0)","v":{"$error":"#N/A"}},{"$f":"VLOOKUP($B73,'Runde 5'!$A$2:$C$97,3,0)","v":{"$error":"#N/A"}},{"$f":"VLOOKUP($B73,'Runde 6'!$A$2:$C$97,3,0)","v":{"$error":"#N/A"}},{"$f":"VLOOKUP($B73,'Runde 7'!$A$2:$C$97,3,0)","v":{"$error":"#N/A"}},{"$error":"#N/A"}]
[null,73,null,{"$f":"VLOOKUP($B74,'Runde 1'!$A$2:$C$97,3,0)","v":{"$error":"#N/A"}},{"$f":"VLOOKUP($B74,'Runde 2'!$A$2:$C$97,3,0)","v":{"$error":"#N/A"}},{"$f":"VLOOKUP($B74,'Runde 3'!$A$2:$C$97,3,0)","v":{"$error":"#N/A"}},{"$f":"VLOOKUP($B74,'Runde 4'!$A$2:$C$97,3,0)","v":{"$error":"#N/A"}},{"$f":"VLOOKUP($B74,'Runde 5'!$A$2:$C$97,3,0)","v":{"$error":"#N/A"}},{"$f":"VLOOKUP($B74,'Runde 6'!$A$2:$C$97,3,0)","v":{"$error":"#N/A"}},{"$f":"VLOOKUP($B74,'Runde 7'!$A$2:$C$97,3,0)","v":{"$error":"#N/A"}},{"$error":"#N/A"}]
[null,74,null,{"$f":"VLOOKUP($B75,'Runde 1'!$A$2:$C$97,3,0)","v":{"$error":"#N/A"}},{"$f":"VLOOKUP($B75,'Runde 2'!$A$2:$C$97,3,0)","v":{"$error":"#N/A"}},{"$f":"VLOOKUP($B75,'Runde 3'!$A$2:$C$97,3,0)","v":{"$error":"#N/A"}},{"$f":"VLOOKUP($B75,'Runde 4'!$A$2:$C$97,3,0)","v":{"$error":"#N/A"}},{"$f":"VLOOKUP($B75,'Runde 5'!$A$2:$C$97,3,0)","v":{"$error":"#N/A"}},{"$f":"VLOOKUP($B75,'Runde 6'!$A$2:$C$97,3,0)","v":{"$error":"#N/A"}},{"$f":"VLOOKUP($B75,'Runde 7'!$A$2:$C$97,3,0)","v":{"$error":"#N/A"}},{"$error":"#N/A"}]
[null,75,null,{"$f":"VLOOKUP($B76,'Runde 1'!$A$2:$C$97,3,0)","v":{"$error":"#N/A"}},{"$f":"VLOOKUP($B76,'Runde 2'!$A$2:$C$97,3,0)","v":{"$error":"#N/A"}},{"$f":"VLOOKUP($B76,'Runde 3'!$A$2:$C$97,3,0)","v":{"$error":"#N/A"}},{"$f":"VLOOKUP($B76,'Runde 4'!$A$2:$C$97,3,0)","v":{"$error":"#N/A"}},{"$f":"VLOOKUP($B76,'Runde 5'!$A$2:$C$97,3,0)","v":{"$error":"#N/A"}},{"$f":"VLOOKUP($B76,'Runde 6'!$A$2:$C$97,3,0)","v":{"$error":"#N/A"}},{"$f":"VLOOKUP($B76,'Runde 7'!$A$2:$C$97,3,0)","v":{"$error":"#N/A"}},{"$error":"#N/A"}]
[null,76,null,{"$f":"VLOOKUP($B77,'Runde 1'!$A$2:$C$97,3,0)","v":{"$error":"#N/A"}},{"$f":"VLOOKUP($B77,'Runde 2'!$A$2:$C$97,3,0)","v":{"$error":"#N/A"}},{"$f":"VLOOKUP($B77,'Runde 3'!$A$2:$C$97,3,0)","v":{"$error":"#N/A"}},{"$f":"VLOOKUP($B77,'Runde 4'!$A$2:$C$97,3,0)","v":{"$error":"#N/A"}},{"$f":"VLOOKUP($B77,'Runde 5'!$A$2:$C$97,3,0)","v":{"$error":"#N/A"}},{"$f":"VLOOKUP($B77,'Runde 6'!$A$2:$C$97,3,0)","v":{"$error":"#N/A"}},{"$f":"VLOOKUP($B77,'Runde 7'!$A$2:$C$97,3,0)","v":{"$error":"#N/A"}},{"$error":"#N/A"}]
[null,77,null,{"$f":"VLOOKUP($B78,'Runde 1'!$A$2:$C$97,3,0)","v":{"$error":"#N/A"}},{"$f":"VLOOKUP($B78,'Runde 2'!$A$2:$C$97,3,0)","v":{"$error":"#N/A"}},{"$f":"VLOOKUP($B78,'Runde 3'!$A$2:$C$97,3,0)","v":{"$error":"#N/A"}},{"$f":"VLOOKUP($B78,'Runde 4'!$A$2:$C$97,3,0)","v":{"$error":"#N/A"}},{"$f":"VLOOKUP($B78,'Runde 5'!$A$2:$C$97,3,0)","v":{"$error":"#N/A"}},{"$f":"VLOOKUP($B78,'Runde 6'!$A$2:$C$97,3,0)","v":{"$error":"#N/A"}},{"$f":"VLOOKUP($B78,'Runde 7'!$A$2:$C$97,3,0)","v":{"$error":"#N/A"}},{"$error":"#N/A"}]
[null,78,null,{"$f":"VLOOKUP($B79,'Runde 1'!$A$2:$C$97,3,0)","v":{"$error":"#N/A"}},{"$f":"VLOOKUP($B79,'Runde 2'!$A$2:$C$97,3,0)","v":{"$error":"#N/A"}},{"$f":"VLOOKUP($B79,'Runde 3'!$A$2:$C$97,3,0)","v":{"$error":"#N/A"}},{"$f":"VLOOKUP($B79,'Runde 4'!$A$2:$C$97,3,0)","v":{"$error":"#N/A"}},{"$f":"VLOOKUP($B79,'Runde 5'!$A$2:$C$97,3,0)","v":{"$error":"#N/A"}},{"$f":"VLOOKUP($B79,'Runde 6'!$A$2:$C$97,3,0)","v":{"$error":"#N/A"}},{"$f":"VLOOKUP($B79,'Runde 7'!$A$2:$C$97,3,0)","v":{"$error":"#N/A"}},{"$error":"#N/A"}]
[null,79,null,{"$f":"VLOOKUP($B80,'Runde 1'!$A$2:$C$97,3,0)","v":{"$error":"#N/A"}},{"$f":"VLOOKUP($B80,'Runde 2'!$A$2:$C$97,3,0)","v":{"$error":"#N/A"}},{"$f":"VLOOKUP($B80,'Runde 3'!$A$2:$C$97,3,0)","v":{"$error":"#N/A"}},{"$f":"VLOOKUP($B80,'Runde 4'!$A$2:$C$97,3,0)","v":{"$error":"#N/A"}},{"$f":"VLOOKUP($B80,'Runde 5'!$A$2:$C$97,3,0)","v":{"$error":"#N/A"}},{"$f":"VLOOKUP($B80,'Runde 6'!$A$2:$C$97,3,0)","v":{"$error":"#N/A"}},{"$f":"VLOOKUP($B80,'Runde 7'!$A$2:$C$97,3,0)","v":{"$error":"#N/A"}},{"$error":"#N/A"}]
[null,80,null,{"$f":"VLOOKUP($B81,'Runde 1'!$A$2:$C$97,3,0)","v":{"$error":"#N/A"}},{"$f":"VLOOKUP($B81,'Runde 2'!$A$2:$C$97,3,0)","v":{"$error":"#N/A"}},{"$f":"VLOOKUP($B81,'Runde 3'!$A$2:$C$97,3,0)","v":{"$error":"#N/A"}},{"$f":"VLOOKUP($B81,'Runde 4'!$A$2:$C$97,3,0)","v":{"$error":"#N/A"}},{"$f":"VLOOKUP($B81,'Runde 5'!$A$2:$C$97,3,0)","v":{"$error":"#N/A"}},{"$f":"VLOOKUP($B81,'Runde 6'!$A$2:$C$97,3,0)","v":{"$error":"#N/A"}},{"$f":"VLOOKUP($B81,'Runde 7'!$A$2:$C$97,3,0)","v":{"$error":"#N/A"}},{"$f":"SUM(D81:J81)","v":{"$error":"#N/A"}}]
[null,81,null,{"$f":"VLOOKUP($B82,'Runde 1'!$A$2:$C$97,3,0)","v":{"$error":"#N/A"}},{"$f":"VLOOKUP($B82,'Runde 2'!$A$2:$C$97,3,0)","v":{"$error":"#N/A"}},{"$f":"VLOOKUP($B82,'Runde 3'!$A$2:$C$97,3,0)","v":{"$error":"#N/A"}},{"$f":"VLOOKUP($B82,'Runde 4'!$A$2:$C$97,3,0)","v":{"$error":"#N/A"}},{"$f":"VLOOKUP($B82,'Runde 5'!$A$2:$C$97,3,0)","v":{"$error":"#N/A"}},{"$f":"VLOOKUP($B82,'Runde 6'!$A$2:$C$97,3,0)","v":{"$error":"#N/A"}},{"$f":"VLOOKUP($B82,'Runde 7'!$A$2:$C$97,3,0)","v":{"$error":"#N/A"}},{"$error":"#N/A"}]
[null,82,null,{"$f":"VLOOKUP($B83,'Runde 1'!$A$2:$C$97,3,0)","v":{"$error":"#N/A"}},{"$f":"VLOOKUP($B83,'Runde 2'!$A$2:$C$97,3,0)","v":{"$error":"#N/A"}},{"$f":"VLOOKUP($B83,'Runde 3'!$A$2:$C$97,3,0)","v":{"$error":"#N/A"}},{"$f":"VLOOKUP($B83,'Runde 4'!$A$2:$C$97,3,0)","v":{"$error":"#N/A"}},{"$f":"VLOOKUP($B83,'Runde 5'!$A$2:$C$97,3,0)","v":{"$error":"#N/A"}},{"$f":"VLOOKUP($B83,'Runde 6'!$A$2:$C$97,3,0)","v":{"$error":"#N/A"}},{"$f":"VLOOKUP($B83,'Runde 7'!$A$2:$C$97,3,0)","v":{"$error":"#N/A"}},{"$error":"#N/A"}]
[null,83,null,{"$f":"VLOOKUP($B84,'Runde 1'!$A$2:$C$97,3,0)","v":{"$error":"#N/A"}},{"$f":"VLOOKUP($B84,'Runde 2'!$A$2:$C$97,3,0)","v":{"$error":"#N/A"}},{"$f":"VLOOKUP($B84,'Runde 3'!$A$2:$C$97,3,0)","v":{"$error":"#N/A"}},{"$f":"VLOOKUP($B84,'Runde 4'!$A$2:$C$97,3,0)","v":{"$error":"#N/A"}},{"$f":"VLOOKUP($B84,'Runde 5'!$A$2:$C$97,3,0)","v":{"$error":"#N/A"}},{"$f":"VLOOKUP($B84,'Runde 6'!$A$2:$C$97,3,0)","v":{"$error":"#N/A"}},{"$f":"VLOOKUP($B84,'Runde 7'!$A$2:$C$97,3,0)","v":{"$error":"#N/A"}},{"$error":"#N/A"}]
[null,84,null,{"$f":"VLOOKUP($B85,'Runde 1'!$A$2:$C$97,3,0)","v":{"$error":"#N/A"}},{"$f":"VLOOKUP($B85,'Runde 2'!$A$2:$C$97,3,0)","v":{"$error":"#N/A"}},{"$f":"VLOOKUP($B85,'Runde 3'!$A$2:$C$97,3,0)","v":{"$error":"#N/A"}},{"$f":"VLOOKUP($B85,'Runde 4'!$A$2:$C$97,3,0)","v":{"$error":"#N/A"}},{"$f":"VLOOKUP($B85,'Runde 5'!$A$2:$C$97,3,0)","v":{"$error":"#N/A"}},{"$f":"VLOOKUP($B85,'Runde 6'!$A$2:$C$97,3,0)","v":{"$error":"#N/A"}},{"$f":"VLOOKUP($B85,'Runde 7'!$A$2:$C$97,3,0)","v":{"$error":"#N/A"}},{"$error":"#N/A"}]
[null,85,null,{"$f":"VLOOKUP($B86,'Runde 1'!$A$2:$C$97,3,0)","v":{"$error":"#N/A"}},{"$f":"VLOOKUP($B86,'Runde 2'!$A$2:$C$97,3,0)","v":{"$error":"#N/A"}},{"$f":"VLOOKUP($B86,'Runde 3'!$A$2:$C$97,3,0)","v":{"$error":"#N/A"}},{"$f":"VLOOKUP($B86,'Runde 4'!$A$2:$C$97,3,0)","v":{"$error":"#N/A"}},{"$f":"VLOOKUP($B86,'Runde 5'!$A$2:$C$97,3,0)","v":{"$error":"#N/A"}},{"$f":"VLOOKUP($B86,'Runde 6'!$A$2:$C$97,3,0)","v":{"$error":"#N/A"}},{"$f":"VLOOKUP($B86,'Runde 7'!$A$2:$C$97,3,0)","v":{"$error":"#N/A"}},{"$error":"#N/A"}]
[null,86,null,{"$f":"VLOOKUP($B87,'Runde 1'!$A$2:$C$97,3,0)","v":{"$error":"#N/A"}},{"$f":"VLOOKUP($B87,'Runde 2'!$A$2:$C$97,3,0)","v":{"$error":"#N/A"}},{"$f":"VLOOKUP($B87,'Runde 3'!$A$2:$C$97,3,0)","v":{"$error":"#N/A"}},{"$f":"VLOOKUP($B87,'Runde 4'!$A$2:$C$97,3,0)","v":{"$error":"#N/A"}},{"$f":"VLOOKUP($B87,'Runde 5'!$A$2:$C$97,3,0)","v":{"$error":"#N/A"}},{"$f":"VLOOKUP($B87,'Runde 6'!$A$2:$C$97,3,0)","v":{"$error":"#N/A"}},{"$f":"VLOOKUP($B87,'Runde 7'!$A$2:$C$97,3,0)","v":{"$error":"#N/A"}},{"$error":"#N/A"}]
[null,87,null,{"$f":"VLOOKUP($B88,'Runde 1'!$A$2:$C$97,3,0)","v":{"$error":"#N/A"}},{"$f":"VLOOKUP($B88,'Runde 2'!$A$2:$C$97,3,0)","v":{"$error":"#N/A"}},{"$f":"VLOOKUP($B88,'Runde 3'!$A$2:$C$97,3,0)","v":{"$error":"#N/A"}},{"$f":"VLOOKUP($B88,'Runde 4'!$A$2:$C$97,3,0)","v":{"$error":"#N/A"}},{"$f":"VLOOKUP($B88,'Runde 5'!$A$2:$C$97,3,0)","v":{"$error":"#N/A"}},{"$f":"VLOOKUP($B88,'Runde 6'!$A$2:$C$97,3,0)","v":{"$error":"#N/A"}},{"$f":"VLOOKUP($B88,'Runde 7'!$A$2:$C$97,3,0)","v":{"$error":"#N/A"}},{"$error":"#N/A"}]
[null,88,null,{"$f":"VLOOKUP($B89,'Runde 1'!$A$2:$C$97,3,0)","v":{"$error":"#N/A"}},{"$f":"VLOOKUP($B89,'Runde 2'!$A$2:$C$97,3,0)","v":{"$error":"#N/A"}},{"$f":"VLOOKUP($B89,'Runde 3'!$A$2:$C$97,3,0)","v":{"$error":"#N/A"}},{"$f":"VLOOKUP($B89,'Runde 4'!$A$2:$C$97,3,0)","v":{"$error":"#N/A"}},{"$f":"VLOOKUP($B89,'Runde 5'!$A$2:$C$97,3,0)","v":{"$error":"#N/A"}},{"$f":"VLOOKUP($B89,'Runde 6'!$A$2:$C$97,3,0)","v":{"$error":"#N/A"}},{"$f":"VLOOKUP($B89,'Runde 7'!$A$2:$C$97,3,0)","v":{"$error":"#N/A"}},{"$error":"#N/A"}]
[null,89,null,{"$f":"VLOOKUP($B90,'Runde 1'!$A$2:$C$97,3,0)","v":{"$error":"#N/A"}},{"$f":"VLOOKUP($B90,'Runde 2'!$A$2:$C$97,3,0)","v":{"$error":"#N/A"}},{"$f":"VLOOKUP($B90,'Runde 3'!$A$2:$C$97,3,0)","v":{"$error":"#N/A"}},{"$f":"VLOOKUP($B90,'Runde 4'!$A$2:$C$97,3,0)","v":{"$error":"#N/A"}},{"$f":"VLOOKUP($B90,'Runde 5'!$A$2:$C$97,3,0)","v":{"$error":"#N/A"}},{"$f":"VLOOKUP($B90,'Runde 6'!$A$2:$C$97,3,0)","v":{"$error":"#N/A"}},{"$f":"VLOOKUP($B90,'Runde 7'!$A$2:$C$97,3,0)","v":{"$error":"#N/A"}},{"$error":"#N/A"}]
[null,90,null,{"$f":"VLOOKUP($B91,'Runde 1'!$A$2:$C$97,3,0)","v":{"$error":"#N/A"}},{"$f":"VLOOKUP($B91,'Runde 2'!$A$2:$C$97,3,0)","v":{"$error":"#N/A"}},{"$f":"VLOOKUP($B91,'Runde 3'!$A$2:$C$97,3,0)","v":{"$error":"#N/A"}},{"$f":"VLOOKUP($B91,'Runde 4'!$A$2:$C$97,3,0)","v":{"$error":"#N/A"}},{"$f":"VLOOKUP($B91,'Runde 5'!$A$2:$C$97,3,0)","v":{"$error":"#N/A"}},{"$f":"VLOOKUP($B91,'Runde 6'!$A$2:$C$97,3,0)","v":{"$error":"#N/A"}},{"$f":"VLOOKUP($B91,'Runde 7'!$A$2:$C$97,3,0)","v":{"$error":"#N/A"}},{"$error":"#N/A"}]
[null,91,null,{"$f":"VLOOKUP($B92,'Runde 1'!$A$2:$C$97,3,0)","v":{"$error":"#N/A"}},{"$f":"VLOOKUP($B92,'Runde 2'!$A$2:$C$97,3,0)","v":{"$error":"#N/A"}},{"$f":"VLOOKUP($B92,'Runde 3'!$A$2:$C$97,3,0)","v":{"$error":"#N/A"}},{"$f":"VLOOKUP($B92,'Runde 4'!$A$2:$C$97,3,0)","v":{"$error":"#N/A"}},{"$f":"VLOOKUP($B92,'Runde 5'!$A$2:$C$97,3,0)","v":{"$error":"#N/A"}},{"$f":"VLOOKUP($B92,'Runde 6'!$A$2:$C$97,3,0)","v":{"$error":"#N/A"}},{"$f":"VLOOKUP($B92,'Runde 7'!$A$2:$C$97,3,0)","v":{"$error":"#N/A"}},{"$error":"#N/A"}]
[null,92,null,{"$f":"VLOOKUP($B93,'Runde 1'!$A$2:$C$97,3,0)","v":{"$error":"#N/A"}},{"$f":"VLOOKUP($B93,'Runde 2'!$A$2:$C$97,3,0)","v":{"$error":"#N/A"}},{"$f":"VLOOKUP($B93,'Runde 3'!$A$2:$C$97,3,0)","v":{"$error":"#N/A"}},{"$f":"VLOOKUP($B93,'Runde 4'!$A$2:$C$97,3,0)","v":{"$error":"#N/A"}},{"$f":"VLOOKUP($B93,'Runde 5'!$A$2:$C$97,3,0)","v":{"$error":"#N/A"}},{"$f":"VLOOKUP($B93,'Runde 6'!$A$2:$C$97,3,0)","v":{"$error":"#N/A"}},{"$f":"VLOOKUP($B93,'Runde 7'!$A$2:$C$97,3,0)","v":{"$error":"#N/A"}},{"$error":"#N/A"}]
[null,93,null,{"$f":"VLOOKUP($B94,'Runde 1'!$A$2:$C$97,3,0)","v":{"$error":"#N/A"}},{"$f":"VLOOKUP($B94,'Runde 2'!$A$2:$C$97,3,0)","v":{"$error":"#N/A"}},{"$f":"VLOOKUP($B94,'Runde 3'!$A$2:$C$97,3,0)","v":{"$error":"#N/A"}},{"$f":"VLOOKUP($B94,'Runde 4'!$A$2:$C$97,3,0)","v":{"$error":"#N/A"}},{"$f":"VLOOKUP($B94,'Runde 5'!$A$2:$C$97,3,0)","v":{"$error":"#N/A"}},{"$f":"VLOOKUP($B94,'Runde 6'!$A$2:$C$97,3,0)","v":{"$error":"#N/A"}},{"$f":"VLOOKUP($B94,'Runde 7'!$A$2:$C$97,3,0)","v":{"$error":"#N/A"}},{"$error":"#N/A"}]
[null,94,null,{"$f":"VLOOKUP($B95,'Runde 1'!$A$2:$C$97,3,0)","v":{"$error":"#N/A"}},{"$f":"VLOOKUP($B95,'Runde 2'!$A$2:$C$97,3,0)","v":{"$error":"#N/A"}},{"$f":"VLOOKUP($B95,'Runde 3'!$A$2:$C$97,3,0)","v":{"$error":"#N/A"}},{"$f":"VLOOKUP($B95,'Runde 4'!$A$2:$C$97,3,0)","v":{"$error":"#N/A"}},{"$f":"VLOOKUP($B95,'Runde 5'!$A$2:$C$97,3,0)","v":{"$error":"#N/A"}},{"$f":"VLOOKUP($B95,'Runde 6'!$A$2:$C$97,3,0)","v":{"$error":"#N/A"}},{"$f":"VLOOKUP($B95,'Runde 7'!$A$2:$C$97,3,0)","v":{"$error":"#N/A"}},{"$error":"#N/A"}]
[null,95,null,{"$f":"VLOOKUP($B96,'Runde 1'!$A$2:$C$97,3,0)","v":{"$error":"#N/A"}},{"$f":"VLOOKUP($B96,'Runde 2'!$A$2:$C$97,3,0)","v":{"$error":"#N/A"}},{"$f":"VLOOKUP($B96,'Runde 3'!$A$2:$C$97,3,0)","v":{"$error":"#N/A"}},{"$f":"VLOOKUP($B96,'Runde 4'!$A$2:$C$97,3,0)","v":{"$error":"#N/A"}},{"$f":"VLOOKUP($B96,'Runde 5'!$A$2:$C$97,3,0)","v":{"$error":"#N/A"}},{"$f":"VLOOKUP($B96,'Runde 6'!$A$2:$C$97,3,0)","v":{"$error":"#N/A"}},{"$f":"VLOOKUP($B96,'Runde 7'!$A$2:$C$97,3,0)","v":{"$error":"#N/A"}},{"$error":"#N/A"}]
[null,96,null,{"$f":"VLOOKUP($B97,'Runde 1'!$A$2:$C$97,3,0)","v":{"$error":"#N/A"}},{"$f":"VLOOKUP($B97,'Runde 2'!$A$2:$C$97,3,0)","v":{"$error":"#N/A"}},{"$f":"VLOOKUP($B97,'Runde 3'!$A$2:$C$97,3,0)","v":{"$error":"#N/A"}},{"$f":"VLOOKUP($B97,'Runde 4'!$A$2:$C$97,3,0)","v":{"$error":"#N/A"}},{"$f":"VLOOKUP($B97,'Runde 5'!$A$2:$C$97,3,0)","v":{"$error":"#N/A"}},{"$f":"VLOOKUP($B97,'Runde 6'!$A$2:$C$97,3,0)","v":{"$error":"#N/A"}},{"$f":"VLOOKUP($B97,'Runde 7'!$A$2:$C$97,3,0)","v":{"$error":"#N/A"}},{"$error":"#N/A"}]

{"sheet":"Auslosung1","index":2,"n_rows":97,"n_cols":8,"rows_kept":97,"cut":false,"hidden":false,"merged":[]}
[2,"UNTEN evt. Anzahl der Mannschaften korrigieren",null,null,"Zahl","TISCH","Mannschaft Nr.","Name"]
[7,20,null,null,1,1,{"$f":"A1","v":2},{"$f":"VLOOKUP(A1,'Meldung (Reihung nach Spielnr.)'!$B$2:$C$97,2)","v":"Annette u Veronika/Telfs"}]
[16,null,null,null,2,1,{"$f":"A2","v":7},{"$f":"VLOOKUP(A2,'Meldung (Reihung nach Spielnr.)'!$B$2:$C$97,2)","v":"Thomas Heltschl u Fredl Mungenast/Imst"}]
[4,null,null,null,3,2,16,{"$f":"VLOOKUP(A3,'Meldung (Reihung nach Spielnr.)'!$B$2:$C$97,2)","v":"Hermann Lechner u Andreas Oberacher/Kematen"}]
[1,null,null,null,4,2,4,{"$f":"VLOOKUP(A4,'Meldung (Reihung nach Spielnr.)'!$B$2:$C$97,2)","v":"Andi Krajic u Peter Doblander/Tarrenz"}]
[8,null,null,null,5,3,1,{"$f":"VLOOKUP(A5,'Meldung (Reihung nach Spielnr.)'!$B$2:$C$97,2)","v":"Edi u Gerald/Telfs"}]
[20,null,null,null,6,3,8,{"$f":"VLOOKUP(A6,'Meldung (Reihung nach Spielnr.)'!$B$2:$C$97,2)","v":"Herbert Lechleitner u  Stefan Krabichler/Imst"}]
[11,null,null,null,7,4,20,{"$f":"VLOOKUP(A7,'Meldung (Reihung nach Spielnr.)'!$B$2:$C$97,2)","v":"Krissmer Reinhard | Fringer Fred"}]
[12,null,null,null,8,4,11,{"$f":"VLOOKUP(A8,'Meldung (Reihung nach Spielnr.)'!$B$2:$C$97,2)","v":"Heini Gruber u Gottfried Geier/Südtirol"}]
[9,null,null,null,9,5,12,{"$f":"VLOOKUP(A9,'Meldung (Reihung nach Spielnr.)'!$B$2:$C$97,2)","v":"Heinrich Ebner u Erich Peer/Südtirol"}]
[6,null,null,null,10,5,9,{"$f":"VLOOKUP(A10,'Meldung (Reihung nach Spielnr.)'!$B$2:$C$97,2)","v":"Rudi Kastner u Peter Tschenett/Imst"}]
[19,null,null,null,11,6,6,{"$f":"VLOOKUP(A11,'Meldung (Reihung nach Spielnr.)'!$B$2:$C$97,2)","v":"Hans Perktold u Horst Friedl/Imst"}]
[10,null,null,null,12,6,19,{"$f":"VLOOKUP(A12,'Meldung (Reihung nach Spielnr.)'!$B$2:$C$97,2)","v":"Kurt Zebisch | Mr. Bean"}]
[13,null,null,null,13,7,10,{"$f":"VLOOKUP(A13,'Meldung (Reihung nach Spielnr.)'!$B$2:$C$97,2)","v":"Franz Pellegrini u Hans Matha/Südtirol"}]
[5,null,null,null,14,7,13,{"$f":"VLOOKUP(A14,'Meldung (Reihung nach Spielnr.)'!$B$2:$C$97,2)","v":"Peter Auer u Stefan Sarg/Axams"}]
[18,null,null,null,15,8,5,{"$f":"VLOOKUP(A15,'Meldung (Reihung nach Spielnr.)'!$B$2:$C$97,2)","v":"Gerhard Schuler u Meinhard Eiter/Imst"}]
[14,null,null,null,16,8,18,{"$f":"VLOOKUP(A16,'Meldung (Reihung nach Spielnr.)'!$B$2:$C$97,2)","v":"Josef Eisenbeutl u Herbert Gamper/Imst"}]
[3,null,null,null,17,9,14,{"$f":"VLOOKUP(A17,'Meldung (Reihung nach Spielnr.)'!$B$2:$C$97,2)","v":"Hansjörg Hell u Franz Braunegger/Axams"}]
[15,null,null,null,18,9,3,{"$f":"VLOOKUP(A18,'Meldung (Reihung nach Spielnr.)'!$B$2:$C$97,2)","v":"Hubert Auer u Daniela Nöbauer/Telfs"}]
[17,"19 Paare",null,null,19,10,15,{"$f":"VLOOKUP(A19,'Meldung (Reihung nach Spielnr.)'!$B$2:$C$97,2)","v":"Bernhard Meischberger u Martin Staggl/Kematen"}]
[null,"20 Paare",null,null,20,10,17,{"$f":"VLOOKUP(A20,'Meldung (Reihung nach Spielnr.)'!$B$2:$C$97,2)","v":"Karin Logar u Rudolf Häusler/Kematen"}]
[null,"22 Paare",null,null,21,11,0,{"$f":"VLOOKUP(A21,'Meldung (Reihung nach Spielnr.)'!$B$2:$C$97,2)","v":{"$error":"#N/A"}}]
[null,null,null,null,22,11,0,{"$f":"VLOOKUP(A22,'Meldung (Reihung nach Spielnr.)'!$B$2:$C$97,2)","v":{"$error":"#N/A"}}]
[null,null,null,null,23,12,0,{"$f":"VLOOKUP(A23,'Meldung (Reihung nach Spielnr.)'!$B$2:$C$97,2)","v":{"$error":"#N/A"}}]
[null,null,null,null,24,12,0,{"$f":"VLOOKUP(A24,'Meldung (Reihung nach Spielnr.)'!$B$2:$C$97,2)","v":{"$error":"#N/A"}}]
[null,null,null,null,25,13,0,{"$f":"VLOOKUP(A25,'Meldung (Reihung nach Spielnr.)'!$B$2:$C$97,2)","v":{"$error":"#N/A"}}]
[null,null,null,null,26,13,0,{"$f":"VLOOKUP(A26,'Meldung (Reihung nach Spielnr.)'!$B$2:$C$97,2)","v":{"$error":"#N/A"}}]
[null,null,null,null,27,14,0,{"$f":"VLOOKUP(A27,'Meldung (Reihung nach Spielnr.)'!$B$2:$C$97,2)","v":{"$error":"#N/A"}}]
[null,null,null,null,28,14,0,{"$f":"VLOOKUP(A28,'Meldung (Reihung nach Spielnr.)'!$B$2:$C$97,2)","v":{"$error":"#N/A"}}]
[null,null,null,null,29,15,0,{"$f":"VLOOKUP(A29,'Meldung (Reihung nach Spielnr.)'!$B$2:$C$97,2)","v":{"$error":"#N/A"}}]
[null,null,null,null,30,15,0,{"$f":"VLOOKUP(A30,'Meldung (Reihung nach Spielnr.)'!$B$2:$C$97,2)","v":{"$error":"#N/A"}}]
[null,null,null,null,31,16,0,{"$f":"VLOOKUP(A31,'Meldung (Reihung nach Spielnr.)'!$B$2:$C$97,2)","v":{"$error":"#N/A"}}]
[null,null,null,null,32,16,0,{"$f":"VLOOKUP(A32,'Meldung (Reihung nach Spielnr.)'!$B$2:$C$97,2)","v":{"$error":"#N/A"}}]
[null,null,null,null,33,17,0,{"$f":"VLOOKUP(A33,'Meldung (Reihung nach Spielnr.)'!$B$2:$C$97,2)","v":{"$error":"#N/A"}}]
[null,null,null,null,34,17,0,{"$f":"VLOOKUP(A34,'Meldung (Reihung nach Spielnr.)'!$B$2:$C$97,2)","v":{"$error":"#N/A"}}]
[null,null,null,null,35,18,0,{"$f":"VLOOKUP(A35,'Meldung (Reihung nach Spielnr.)'!$B$2:$C$97,2)","v":{"$error":"#N/A"}}]
[null,null,null,null,36,18,0,{"$f":"VLOOKUP(A36,'Meldung (Reihung nach Spielnr.)'!$B$2:$C$97,2)","v":{"$error":"#N/A"}}]
[null,null,null,null,37,19,0,{"$f":"VLOOKUP(A37,'Meldung (Reihung nach Spielnr.)'!$B$2:$C$97,2)","v":{"$error":"#N/A"}}]
[null,null,null,null,38,19,0,{"$f":"VLOOKUP(A38,'Meldung (Reihung nach Spielnr.)'!$B$2:$C$97,2)","v":{"$error":"#N/A"}}]
[null,null,null,null,39,20,0,{"$f":"VLOOKUP(A39,'Meldung (Reihung nach Spielnr.)'!$B$2:$C$97,2)","v":{"$error":"#N/A"}}]
[null,null,null,null,40,20,0,{"$f":"VLOOKUP(A40,'Meldung (Reihung nach Spielnr.)'!$B$2:$C$97,2)","v":{"$error":"#N/A"}}]
[null,null,null,null,41,21,0,{"$f":"VLOOKUP(A41,'Meldung (Reihung nach Spielnr.)'!$B$2:$C$97,2)","v":{"$error":"#N/A"}}]
[null,null,null,null,42,21,0,{"$f":"VLOOKUP(A42,'Meldung (Reihung nach Spielnr.)'!$B$2:$C$97,2)","v":{"$error":"#N/A"}}]
[null,null,null,null,43,22,0,{"$f":"VLOOKUP(A43,'Meldung (Reihung nach Spielnr.)'!$B$2:$C$97,2)","v":{"$error":"#N/A"}}]
[null,null,null,null,44,22,0,{"$f":"VLOOKUP(A44,'Meldung (Reihung nach Spielnr.)'!$B$2:$C$97,2)","v":{"$error":"#N/A"}}]
[null,null,null,null,45,23,0,{"$f":"VLOOKUP(A45,'Meldung (Reihung nach Spielnr.)'!$B$2:$C$97,2)","v":{"$error":"#N/A"}}]
[null,null,null,null,46,23,0,{"$f":"VLOOKUP(A46,'Meldung (Reihung nach Spielnr.)'!$B$2:$C$97,2)","v":{"$error":"#N/A"}}]
[null,null,null,null,47,24,0,{"$f":"VLOOKUP(A47,'Meldung (Reihung nach Spielnr.)'!$B$2:$C$97,2)","v":{"$error":"#N/A"}}]
[null,null,null,null,48,24,0,{"$f":"VLOOKUP(A48,'Meldung (Reihung nach Spielnr.)'!$B$2:$C$97,2)","v":{"$error":"#N/A"}}]
[null,null,null,null,49,25,0,{"$f":"VLOOKUP(A49,'Meldung (Reihung nach Spielnr.)'!$B$2:$C$97,2)","v":{"$error":"#N/A"}}]
[null,null,null,null,50,25,0,{"$f":"VLOOKUP(A50,'Meldung (Reihung nach Spielnr.)'!$B$2:$C$97,2)","v":{"$error":"#N/A"}}]
[null,null,null,null,51,26,0,{"$f":"VLOOKUP(A51,'Meldung (Reihung nach Spielnr.)'!$B$2:$C$97,2)","v":{"$error":"#N/A"}}]
[null,null,null,null,52,26,0,{"$f":"VLOOKUP(A52,'Meldung (Reihung nach Spielnr.)'!$B$2:$C$97,2)","v":{"$error":"#N/A"}}]
[null,null,null,null,53,27,0,{"$f":"VLOOKUP(A53,'Meldung (Reihung nach Spielnr.)'!$B$2:$C$97,2)","v":{"$error":"#N/A"}}]
[null,null,null,null,54,27,0,{"$f":"VLOOKUP(A54,'Meldung (Reihung nach Spielnr.)'!$B$2:$C$97,2)","v":{"$error":"#N/A"}}]
[null,null,null,null,55,28,0,{"$f":"VLOOKUP(A55,'Meldung (Reihung nach Spielnr.)'!$B$2:$C$97,2)","v":{"$error":"#N/A"}}]
[null,null,null,null,56,28,0,{"$f":"VLOOKUP(A56,'Meldung (Reihung nach Spielnr.)'!$B$2:$C$97,2)","v":{"$error":"#N/A"}}]
[null,null,null,null,57,29,0,{"$f":"VLOOKUP(A57,'Meldung (Reihung nach Spielnr.)'!$B$2:$C$97,2)","v":{"$error":"#N/A"}}]
[null,null,null,null,58,29,0,{"$f":"VLOOKUP(A58,'Meldung (Reihung nach Spielnr.)'!$B$2:$C$97,2)","v":{"$error":"#N/A"}}]
[null,null,null,null,59,30,0,{"$f":"VLOOKUP(A59,'Meldung (Reihung nach Spielnr.)'!$B$2:$C$97,2)","v":{"$error":"#N/A"}}]
[null,null,null,null,60,30,0,{"$f":"VLOOKUP(A60,'Meldung (Reihung nach Spielnr.)'!$B$2:$C$97,2)","v":{"$error":"#N/A"}}]
[null,null,null,null,61,31,0,{"$f":"VLOOKUP(A61,'Meldung (Reihung nach Spielnr.)'!$B$2:$C$97,2)","v":{"$error":"#N/A"}}]
[null,null,null,null,62,31,0,{"$f":"VLOOKUP(A62,'Meldung (Reihung nach Spielnr.)'!$B$2:$C$97,2)","v":{"$error":"#N/A"}}]
[null,null,null,null,63,32,0,{"$f":"VLOOKUP(A63,'Meldung (Reihung nach Spielnr.)'!$B$2:$C$97,2)","v":{"$error":"#N/A"}}]
[null,null,null,null,64,32,0,{"$f":"VLOOKUP(A64,'Meldung (Reihung nach Spielnr.)'!$B$2:$C$97,2)","v":{"$error":"#N/A"}}]
[null,null,null,null,65,33,0,{"$f":"VLOOKUP(A65,'Meldung (Reihung nach Spielnr.)'!$B$2:$C$97,2)","v":{"$error":"#N/A"}}]
[null,null,null,null,66,33,{"$f":"A66","v":0},{"$f":"VLOOKUP(A66,'Meldung (Reihung nach Spielnr.)'!$B$2:$C$97,2)","v":{"$error":"#N/A"}}]
[null,null,null,null,67,17,0,{"$f":"VLOOKUP(A67,'Meldung (Reihung nach Spielnr.)'!$B$2:$C$97,2)","v":{"$error":"#N/A"}}]
[null,null,null,null,68,34,0,{"$f":"VLOOKUP(A68,'Meldung (Reihung nach Spielnr.)'!$B$2:$C$97,2)","v":{"$error":"#N/A"}}]
[null,null,null,null,69,34,0,{"$f":"VLOOKUP(A69,'Meldung (Reihung nach Spielnr.)'!$B$2:$C$97,2)","v":{"$error":"#N/A"}}]
[null,null,null,null,70,35,0,{"$f":"VLOOKUP(A70,'Meldung (Reihung nach Spielnr.)'!$B$2:$C$97,2)","v":{"$error":"#N/A"}}]
[null,null,null,null,71,35,0,{"$f":"VLOOKUP(A71,'Meldung (Reihung nach Spielnr.)'!$B$2:$C$97,2)","v":{"$error":"#N/A"}}]
[null,null,null,null,72,36,0,{"$f":"VLOOKUP(A72,'Meldung (Reihung nach Spielnr.)'!$B$2:$C$97,2)","v":{"$error":"#N/A"}}]
[null,null,null,null,73,36,0,{"$f":"VLOOKUP(A73,'Meldung (Reihung nach Spielnr.)'!$B$2:$C$97,2)","v":{"$error":"#N/A"}}]
[null,null,null,null,74,36,0,{"$f":"VLOOKUP(A74,'Meldung (Reihung nach Spielnr.)'!$B$2:$C$97,2)","v":{"$error":"#N/A"}}]
[null,null,null,null,75,37,0,{"$f":"VLOOKUP(A75,'Meldung (Reihung nach Spielnr.)'!$B$2:$C$97,2)","v":{"$error":"#N/A"}}]
[null,null,null,null,76,37,0,{"$f":"VLOOKUP(A76,'Meldung (Reihung nach Spielnr.)'!$B$2:$C$97,2)","v":{"$error":"#N/A"}}]
[null,null,null,null,77,38,0,{"$f":"VLOOKUP(A77,'Meldung (Reihung nach Spielnr.)'!$B$2:$C$97,2)","v":{"$error":"#N/A"}}]
[null,null,null,null,78,38,0,{"$f":"VLOOKUP(A78,'Meldung (Reihung nach Spielnr.)'!$B$2:$C$97,2)","v":{"$error":"#N/A"}}]
[null,null,null,null,79,39,0,{"$f":"VLOOKUP(A79,'Meldung (Reihung nach Spielnr.)'!$B$2:$C$97,2)","v":{"$error":"#N/A"}}]
[null,null,null,null,80,39,0,{"$f":"VLOOKUP(A80,'Meldung (Reihung nach Spielnr.)'!$B$2:$C$97,2)","v":{"$error":"#N/A"}}]
[null,null,null,null,81,40,0,{"$f":"VLOOKUP(A81,'Meldung (Reihung nach Spielnr.)'!$B$2:$C$97,2)","v":{"$error":"#N/A"}}]
[null,null,null,null,82,40,0,{"$f":"VLOOKUP(A82,'Meldung (Reihung nach Spielnr.)'!$B$2:$C$97,2)","v":{"$error":"#N/A"}}]
[null,null,null,null,83,41,0,{"$f":"VLOOKUP(A83,'Meldung (Reihung nach Spielnr.)'!$B$2:$C$97,2)","v":{"$error":"#N/A"}}]
[null,null,null,null,84,41,0,{"$f":"VLOOKUP(A84,'Meldung (Reihung nach Spielnr.)'!$B$2:$C$97,2)","v":{"$error":"#N/A"}}]
[null,null,null,null,85,42,0,{"$f":"VLOOKUP(A85,'Meldung (Reihung nach Spielnr.)'!$B$2:$C$97,2)","v":{"$error":"#N/A"}}]
[null,null,null,null,86,42,0,{"$f":"VLOOKUP(A86,'Meldung (Reihung nach Spielnr.)'!$B$2:$C$97,2)","v":{"$error":"#N/A"}}]
[null,null,null,null,87,43,0,{"$f":"VLOOKUP(A87,'Meldung (Reihung nach Spielnr.)'!$B$2:$C$97,2)","v":{"$error":"#N/A"}}]
[null,null,null,null,88,4,0,{"$f":"VLOOKUP(A88,'Meldung (Reihung nach Spielnr.)'!$B$2:$C$97,2)","v":{"$error":"#N/A"}}]
[null,null,null,null,89,44,0,{"$f":"VLOOKUP(A89,'Meldung (Reihung nach Spielnr.)'!$B$2:$C$97,2)","v":{"$error":"#N/A"}}]
[null,null,null,null,90,44,0,{"$f":"VLOOKUP(A90,'Meldung (Reihung nach Spielnr.)'!$B$2:$C$97,2)","v":{"$error":"#N/A"}}]
[null,null,null,null,91,45,0,{"$f":"VLOOKUP(A91,'Meldung (Reihung nach Spielnr.)'!$B$2:$C$97,2)","v":{"$error":"#N/A"}}]
[null,null,null,null,92,45,0,{"$f":"VLOOKUP(A92,'Meldung (Reihung nach Spielnr.)'!$B$2:$C$97,2)","v":{"$error":"#N/A"}}]
[null,null,null,null,93,46,0,{"$f":"VLOOKUP(A93,'Meldung (Reihung nach Spielnr.)'!$B$2:$C$97,2)","v":{"$error":"#N/A"}}]
[null,null,null,null,94,46,0,{"$f":"VLOOKUP(A94,'Meldung (Reihung nach Spielnr.)'!$B$2:$C$97,2)","v":{"$error":"#N/A"}}]
[null,null,null,null,95,47,0,{"$f":"VLOOKUP(A95,'Meldung (Reihung nach Spielnr.)'!$B$2:$C$97,2)","v":{"$error":"#N/A"}}]
[null,null,null,null,96,47,0,{"$f":"VLOOKUP(A96,'Meldung (Reihung nach Spielnr.)'!$B$2:$C$97,2)","v":{"$error":"#N/A"}}]

{"sheet":"Runde 1","index":3,"n_rows":99,"n_cols":8,"rows_kept":99,"cut":false,"hidden":false,"merged":[]}
["Spielernr.","Name","Runde 1","Teiln.:",{"$f":"Auslosung1!B2","v":20},"Mannschaft",null,15]
[{"$f":"Auslosung1!G2","v":2},{"$f":"Auslosung1!H2","v":"Annette u Veronika/Telfs"},{"$f":"IF(F3+G3>0,IF(H3=\"OK\",IF(F3<G3,F3,100+(F3-G3)),0),0)","v":112},null,null,{"$f":"VLOOKUP(A2,'Meldung (Reihung nach Spielnr.)'!$B$2:$C$97,2)","v":"Annette u Veronika/Telfs"},{"$f":"VLOOKUP(A3,'Meldung (Reihung nach Spielnr.)'!$B$2:$C$97,2)","v":"Thomas Heltschl u Fredl Mungenast/Imst"}]
[{"$f":"Auslosung1!G3","v":7},{"$f":"Auslosung1!H3","v":"Thomas Heltschl u Fredl Mungenast/Imst"},{"$f":"IF(F3+G3>0,IF(H3=\"OK\",IF(G3<F3,G3,100+(G3-F3)),0),0)","v":3},null,null,15,3,{"$f":"IF(OR(F3>=15,G3>=15),\"OK\",\"Fehlende oder falsche EIngabe\")","v":"OK"}]
[{"$f":"Auslosung1!G4","v":16},{"$f":"Auslosung1!H4","v":"Hermann Lechner u Andreas Oberacher/Kematen"},{"$f":"IF(F5+G5>0,IF(H5=\"OK\",IF(F5<G5,F5,100+(F5-G5)),0),0)","v":0},null,null,{"$f":"VLOOKUP(A4,'Meldung (Reihung nach Spielnr.)'!$B$2:$C$97,2)","v":"Hermann Lechner u Andreas Oberacher/Kematen"},{"$f":"VLOOKUP(A5,'Meldung (Reihung nach Spielnr.)'!$B$2:$C$97,2)","v":"Andi Krajic u Peter Doblander/Tarrenz"}]
[{"$f":"Auslosung1!G5","v":4},{"$f":"Auslosung1!H5","v":"Andi Krajic u Peter Doblander/Tarrenz"},{"$f":"IF(F5+G5>0,IF(H5=\"OK\",IF(G5<F5,G5,100+(G5-F5)),0),0)","v":0},null,null,null,null,{"$f":"IF(OR(F5>=15,G5>=15),\"OK\",\"Fehlende oder falsche EIngabe\")","v":"Fehlende oder falsche EIngabe"}]
[{"$f":"Auslosung1!G6","v":1},{"$f":"Auslosung1!H6","v":"Edi u Gerald/Telfs"},{"$f":"IF(F7+G7>0,IF(H7=\"OK\",IF(F7<G7,F7,100+(F7-G7)),0),0)","v":0},null,null,{"$f":"VLOOKUP(A6,'Meldung (Reihung nach Spielnr.)'!$B$2:$C$97,2)","v":"Edi u Gerald/Telfs"},{"$f":"VLOOKUP(A7,'Meldung (Reihung nach Spielnr.)'!$B$2:$C$97,2)","v":"Herbert Lechleitner u  Stefan Krabichler/Imst"}]
[{"$f":"Auslosung1!G7","v":8},{"$f":"Auslosung1!H7","v":"Herbert Lechleitner u  Stefan Krabichler/Imst"},{"$f":"IF(F7+G7>0,IF(H7=\"OK\",IF(G7<F7,G7,100+(G7-F7)),0),0)","v":0},null,null,null,null,{"$f":"IF(OR(F7>=15,G7>=15),\"OK\",\"Fehlende oder falsche EIngabe\")","v":"Fehlende oder falsche EIngabe"}]
[{"$f":"Auslosung1!G8","v":20},{"$f":"Auslosung1!H8","v":"Krissmer Reinhard | Fringer Fred"},{"$f":"IF(F9+G9>0,IF(H9=\"OK\",IF(F9<G9,F9,100+(F9-G9)),0),0)","v":0},null,null,{"$f":"VLOOKUP(A8,'Meldung (Reihung nach Spielnr.)'!$B$2:$C$97,2)","v":"Krissmer Reinhard | Fringer Fred"},{"$f":"VLOOKUP(A9,'Meldung (Reihung nach Spielnr.)'!$B$2:$C$97,2)","v":"Heini Gruber u Gottfried Geier/Südtirol"}]
[{"$f":"Auslosung1!G9","v":11},{"$f":"Auslosung1!H9","v":"Heini Gruber u Gottfried Geier/Südtirol"},{"$f":"IF(F9+G9>0,IF(H9=\"OK\",IF(G9<F9,G9,100+(G9-F9)),0),0)","v":0},null,null,null,null,{"$f":"IF(OR(F9>=15,G9>=15),\"OK\",\"Fehlende oder falsche EIngabe\")","v":"Fehlende oder falsche EIngabe"}]
[{"$f":"Auslosung1!G10","v":12},{"$f":"Auslosung1!H10","v":"Heinrich Ebner u Erich Peer/Südtirol"},{"$f":"IF(F11+G11>0,IF(H11=\"OK\",IF(F11<G11,F11,100+(F11-G11)),0),0)","v":0},null,null,{"$f":"VLOOKUP(A10,'Meldung (Reihung nach Spielnr.)'!$B$2:$C$97,2)","v":"Heinrich Ebner u Erich Peer/Südtirol"},{"$f":"VLOOKUP(A11,'Meldung (Reihung nach Spielnr.)'!$B$2:$C$97,2)","v":"Rudi Kastner u Peter Tschenett/Imst"}]
[{"$f":"Auslosung1!G11","v":9},{"$f":"Auslosung1!H11","v":"Rudi Kastner u Peter Tschenett/Imst"},{"$f":"IF(F11+G11>0,IF(H11=\"OK\",IF(G11<F11,G11,100+(G11-F11)),0),0)","v":0},null,null,null,null,{"$f":"IF(OR(F11>=15,G11>=15),\"OK\",\"Fehlende oder falsche EIngabe\")","v":"Fehlende oder falsche EIngabe"}]
[{"$f":"Auslosung1!G12","v":6},{"$f":"Auslosung1!H12","v":"Hans Perktold u Horst Friedl/Imst"},{"$f":"IF(F13+G13>0,IF(H13=\"OK\",IF(F13<G13,F13,100+(F13-G13)),0),0)","v":0},null,null,{"$f":"VLOOKUP(A12,'Meldung (Reihung nach Spielnr.)'!$B$2:$C$97,2)","v":"Hans Perktold u Horst Friedl/Imst"},{"$f":"VLOOKUP(A13,'Meldung (Reihung nach Spielnr.)'!$B$2:$C$97,2)","v":"Kurt Zebisch | Mr. Bean"}]
[{"$f":"Auslosung1!G13","v":19},{"$f":"Auslosung1!H13","v":"Kurt Zebisch | Mr. Bean"},{"$f":"IF(F13+G13>0,IF(H13=\"OK\",IF(G13<F13,G13,100+(G13-F13)),0),0)","v":0},null,null,null,null,{"$f":"IF(OR(F13>=15,G13>=15),\"OK\",\"Fehlende oder falsche EIngabe\")","v":"Fehlende oder falsche EIngabe"}]
[{"$f":"Auslosung1!G14","v":10},{"$f":"Auslosung1!H14","v":"Franz Pellegrini u Hans Matha/Südtirol"},{"$f":"IF(F15+G15>0,IF(H15=\"OK\",IF(F15<G15,F15,100+(F15-G15)),0),0)","v":0},null,null,{"$f":"VLOOKUP(A14,'Meldung (Reihung nach Spielnr.)'!$B$2:$C$97,2)","v":"Franz Pellegrini u Hans Matha/Südtirol"},{"$f":"VLOOKUP(A15,'Meldung (Reihung nach Spielnr.)'!$B$2:$C$97,2)","v":"Peter Auer u Stefan Sarg/Axams"}]
[{"$f":"Auslosung1!G15","v":13},{"$f":"Auslosung1!H15","v":"Peter Auer u Stefan Sarg/Axams"},{"$f":"IF(F15+G15>0,IF(H15=\"OK\",IF(G15<F15,G15,100+(G15-F15)),0),0)","v":0},null,null,null,null,{"$f":"IF(OR(F15>=15,G15>=15),\"OK\",\"Fehlende oder falsche EIngabe\")","v":"Fehlende oder falsche EIngabe"}]
[{"$f":"Auslosung1!G16","v":5},{"$f":"Auslosung1!H16","v":"Gerhard Schuler u Meinhard Eiter/Imst"},{"$f":"IF(F17+G17>0,IF(H17=\"OK\",IF(F17<G17,F17,100+(F17-G17)),0),0)","v":0},null,null,{"$f":"VLOOKUP(A16,'Meldung (Reihung nach Spielnr.)'!$B$2:$C$97,2)","v":"Gerhard Schuler u Meinhard Eiter/Imst"},{"$f":"VLOOKUP(A17,'Meldung (Reihung nach Spielnr.)'!$B$2:$C$97,2)","v":"Josef Eisenbeutl u Herbert Gamper/Imst"}]
[{"$f":"Auslosung1!G17","v":18},{"$f":"Auslosung1!H17","v":"Josef Eisenbeutl u Herbert Gamper/Imst"},{"$f":"IF(F17+G17>0,IF(H17=\"OK\",IF(G17<F17,G17,100+(G17-F17)),0),0)","v":0},null,null,null,null,{"$f":"IF(OR(F17>=15,G17>=15),\"OK\",\"Fehlende oder falsche EIngabe\")","v":"Fehlende oder falsche EIngabe"}]
[{"$f":"Auslosung1!G18","v":14},{"$f":"Auslosung1!H18","v":"Hansjörg Hell u Franz Braunegger/Axams"},{"$f":"IF(F19+G19>0,IF(H19=\"OK\",IF(F19<G19,F19,100+(F19-G19)),0),0)","v":0},null,null,{"$f":"VLOOKUP(A18,'Meldung (Reihung nach Spielnr.)'!$B$2:$C$97,2)","v":"Hansjörg Hell u Franz Braunegger/Axams"},{"$f":"VLOOKUP(A19,'Meldung (Reihung nach Spielnr.)'!$B$2:$C$97,2)","v":"Hubert Auer u Daniela Nöbauer/Telfs"}]
[{"$f":"Auslosung1!G19","v":3},{"$f":"Auslosung1!H19","v":"Hubert Auer u Daniela Nöbauer/Telfs"},{"$f":"IF(F19+G19>0,IF(H19=\"OK\",IF(G19<F19,G19,100+(G19-F19)),0),0)","v":0},null,null,null,null,{"$f":"IF(OR(F19>=15,G19>=15),\"OK\",\"Fehlende oder falsche EIngabe\")","v":"Fehlende oder falsche EIngabe"}]
[{"$f":"Auslosung1!G20","v":15},{"$f":"Auslosung1!H20","v":"Bernhard Meischberger u Martin Staggl/Kematen"},{"$f":"IF(F21+G21>0,IF(H21=\"OK\",IF(F21<G21,F21,100+(F21-G21)),0),0)","v":0},null,null,{"$f":"VLOOKUP(A20,'Meldung (Reihung nach Spielnr.)'!$B$2:$C$97,2)","v":"Bernhard Meischberger u Martin Staggl/Kematen"},{"$f":"VLOOKUP(A21,'Meldung (Reihung nach Spielnr.)'!$B$2:$C$97,2)","v":"Karin Logar u Rudolf Häusler/Kematen"}]
[{"$f":"Auslosung1!G21","v":17},{"$f":"Auslosung1!H21","v":"Karin Logar u Rudolf Häusler/Kematen"},{"$f":"IF(F21+G21>0,IF(H21=\"OK\",IF(G21<F21,G21,100+(G21-F21)),0),0)","v":0},null,null,null,null,{"$f":"IF(OR(F21>=15,G21>=15),\"OK\",\"Fehlende oder falsche EIngabe\")","v":"Fehlende oder falsche EIngabe"}]
[{"$f":"Auslosung1!G22","v":0},{"$f":"Auslosung1!H22","v":{"$error":"#N/A"}},{"$f":"IF(F23+G23>0,IF(H23=\"OK\",IF(F23<G23,F23,100+(F23-G23)),0),0)","v":0},null,null,{"$f":"VLOOKUP(A22,'Meldung (Reihung nach Spielnr.)'!$B$2:$C$97,2)","v":{"$error":"#N/A"}},{"$f":"VLOOKUP(A23,'Meldung (Reihung nach Spielnr.)'!$B$2:$C$97,2)","v":{"$error":"#N/A"}}]
[{"$f":"Auslosung1!G23","v":0},{"$f":"Auslosung1!H23","v":{"$error":"#N/A"}},{"$f":"IF(F23+G23>0,IF(H23=\"OK\",IF(G23<F23,G23,100+(G23-F23)),0),0)","v":0},null,null,null,null,{"$f":"IF(OR(F23>=15,G23>=15),\"OK\",\"Fehlende oder falsche EIngabe\")","v":"Fehlende oder falsche EIngabe"}]
[{"$f":"Auslosung1!G24","v":0},{"$f":"Auslosung1!H24","v":{"$error":"#N/A"}},{"$f":"IF(F25+G25>0,IF(H25=\"OK\",IF(F25<G25,F25,100+(F25-G25)),0),0)","v":0},null,null,{"$f":"VLOOKUP(A24,'Meldung (Reihung nach Spielnr.)'!$B$2:$C$97,2)","v":{"$error":"#N/A"}},{"$f":"VLOOKUP(A25,'Meldung (Reihung nach Spielnr.)'!$B$2:$C$97,2)","v":{"$error":"#N/A"}}]
[{"$f":"Auslosung1!G25","v":0},{"$f":"Auslosung1!H25","v":{"$error":"#N/A"}},{"$f":"IF(F25+G25>0,IF(H25=\"OK\",IF(G25<F25,G25,100+(G25-F25)),0),0)","v":0},null,null,null,null,{"$f":"IF(OR(F25>=15,G25>=15),\"OK\",\"Fehlende oder falsche EIngabe\")","v":"Fehlende oder falsche EIngabe"}]
[{"$f":"Auslosung1!G26","v":0},{"$f":"Auslosung1!H26","v":{"$error":"#N/A"}},{"$f":"IF(F27+G27>0,IF(H27=\"OK\",IF(F27<G27,F27,100+(F27-G27)),0),0)","v":0},null,null,{"$f":"VLOOKUP(A26,'Meldung (Reihung nach Spielnr.)'!$B$2:$C$97,2)","v":{"$error":"#N/A"}},{"$f":"VLOOKUP(A27,'Meldung (Reihung nach Spielnr.)'!$B$2:$C$97,2)","v":{"$error":"#N/A"}}]
[{"$f":"Auslosung1!G27","v":0},{"$f":"Auslosung1!H27","v":{"$error":"#N/A"}},{"$f":"IF(F27+G27>0,IF(H27=\"OK\",IF(G27<F27,G27,100+(G27-F27)),0),0)","v":0},null,null,null,null,{"$f":"IF(OR(F27>=15,G27>=15),\"OK\",\"Fehlende oder falsche EIngabe\")","v":"Fehlende oder falsche EIngabe"}]
[{"$f":"Auslosung1!G28","v":0},{"$f":"Auslosung1!H28","v":{"$error":"#N/A"}},{"$f":"IF(F29+G29>0,IF(H29=\"OK\",IF(F29<G29,F29,100+(F29-G29)),0),0)","v":0},null,null,{"$f":"VLOOKUP(A28,'Meldung (Reihung nach Spielnr.)'!$B$2:$C$97,2)","v":{"$error":"#N/A"}},{"$f":"VLOOKUP(A29,'Meldung (Reihung nach Spielnr.)'!$B$2:$C$97,2)","v":{"$error":"#N/A"}}]
[{"$f":"Auslosung1!G29","v":0},{"$f":"Auslosung1!H29","v":{"$error":"#N/A"}},{"$f":"IF(F29+G29>0,IF(H29=\"OK\",IF(G29<F29,G29,100+(G29-F29)),0),0)","v":0},null,null,null,null,{"$f":"IF(OR(F29>=15,G29>=15),\"OK\",\"Fehlende oder falsche EIngabe\")","v":"Fehlende oder falsche EIngabe"}]
[{"$f":"Auslosung1!G30","v":0},{"$f":"Auslosung1!H30","v":{"$error":"#N/A"}},{"$f":"IF(F31+G31>0,IF(H31=\"OK\",IF(F31<G31,F31,100+(F31-G31)),0),0)","v":0},null,null,{"$f":"VLOOKUP(A30,'Meldung (Reihung nach Spielnr.)'!$B$2:$C$97,2)","v":{"$error":"#N/A"}},{"$f":"VLOOKUP(A31,'Meldung (Reihung nach Spielnr.)'!$B$2:$C$97,2)","v":{"$error":"#N/A"}}]
[{"$f":"Auslosung1!G31","v":0},{"$f":"Auslosung1!H31","v":{"$error":"#N/A"}},{"$f":"IF(F31+G31>0,IF(H31=\"OK\",IF(G31<F31,G31,100+(G31-F31)),0),0)","v":0},null,null,null,null,{"$f":"IF(OR(F31>=15,G31>=15),\"OK\",\"Fehlende oder falsche EIngabe\")","v":"Fehlende oder falsche EIngabe"}]
[{"$f":"Auslosung1!G32","v":0},{"$f":"Auslosung1!H32","v":{"$error":"#N/A"}},{"$f":"IF(F33+G33>0,IF(H33=\"OK\",IF(F33<G33,F33,100+(F33-G33)),0),0)","v":0},null,null,{"$f":"VLOOKUP(A32,'Meldung (Reihung nach Spielnr.)'!$B$2:$C$97,2)","v":{"$error":"#N/A"}},{"$f":"VLOOKUP(A33,'Meldung (Reihung nach Spielnr.)'!$B$2:$C$97,2)","v":{"$error":"#N/A"}}]
[{"$f":"Auslosung1!G33","v":0},{"$f":"Auslosung1!H33","v":{"$error":"#N/A"}},{"$f":"IF(F33+G33>0,IF(H33=\"OK\",IF(G33<F33,G33,100+(G33-F33)),0),0)","v":0},null,null,null,null,{"$f":"IF(OR(F33>=15,G33>=15),\"OK\",\"Fehlende oder falsche EIngabe\")","v":"Fehlende oder falsche EIngabe"}]
[{"$f":"Auslosung1!G34","v":0},{"$f":"Auslosung1!H34","v":{"$error":"#N/A"}},{"$f":"IF(F35+G35>0,IF(H35=\"OK\",IF(F35<G35,F35,100+(F35-G35)),0),0)","v":0},null,null,{"$f":"VLOOKUP(A34,'Meldung (Reihung nach Spielnr.)'!$B$2:$C$97,2)","v":{"$error":"#N/A"}},{"$f":"VLOOKUP(A35,'Meldung (Reihung nach Spielnr.)'!$B$2:$C$97,2)","v":{"$error":"#N/A"}}]
[{"$f":"Auslosung1!G35","v":0},{"$f":"Auslosung1!H35","v":{"$error":"#N/A"}},{"$f":"IF(F35+G35>0,IF(H35=\"OK\",IF(G35<F35,G35,100+(G35-F35)),0),0)","v":0},null,null,null,null,{"$f":"IF(OR(F35>=15,G35>=15),\"OK\",\"Fehlende oder falsche EIngabe\")","v":"Fehlende oder falsche EIngabe"}]
[{"$f":"Auslosung1!G36","v":0},{"$f":"Auslosung1!H36","v":{"$error":"#N/A"}},{"$f":"IF(F37+G37>0,IF(H37=\"OK\",IF(F37<G37,F37,100+(F37-G37)),0),0)","v":0},null,null,{"$f":"VLOOKUP(A36,'Meldung (Reihung nach Spielnr.)'!$B$2:$C$97,2)","v":{"$error":"#N/A"}},{"$f":"VLOOKUP(A37,'Meldung (Reihung nach Spielnr.)'!$B$2:$C$97,2)","v":{"$error":"#N/A"}}]
[{"$f":"Auslosung1!G37","v":0},{"$f":"Auslosung1!H37","v":{"$error":"#N/A"}},{"$f":"IF(F37+G37>0,IF(H37=\"OK\",IF(G37<F37,G37,100+(G37-F37)),0),0)","v":0},null,null,null,null,{"$f":"IF(OR(F37>=15,G37>=15),\"OK\",\"Fehlende oder falsche EIngabe\")","v":"Fehlende oder falsche EIngabe"}]
[{"$f":"Auslosung1!G38","v":0},{"$f":"Auslosung1!H38","v":{"$error":"#N/A"}},{"$f":"IF(F39+G39>0,IF(H39=\"OK\",IF(F39<G39,F39,100+(F39-G39)),0),0)","v":0},null,null,{"$f":"VLOOKUP(A38,'Meldung (Reihung nach Spielnr.)'!$B$2:$C$97,2)","v":{"$error":"#N/A"}},{"$f":"VLOOKUP(A39,'Meldung (Reihung nach Spielnr.)'!$B$2:$C$97,2)","v":{"$error":"#N/A"}}]
[{"$f":"Auslosung1!G39","v":0},{"$f":"Auslosung1!H39","v":{"$error":"#N/A"}},{"$f":"IF(F39+G39>0,IF(H39=\"OK\",IF(G39<F39,G39,100+(G39-F39)),0),0)","v":0},null,null,null,null,{"$f":"IF(OR(F39>=15,G39>=15),\"OK\",\"Fehlende oder falsche EIngabe\")","v":"Fehlende oder falsche EIngabe"}]
[{"$f":"Auslosung1!G40","v":0},{"$f":"Auslosung1!H40","v":{"$error":"#N/A"}},{"$f":"IF(F41+G41>0,IF(H41=\"OK\",IF(F41<G41,F41,100+(F41-G41)),0),0)","v":0},null,null,{"$f":"VLOOKUP(A40,'Meldung (Reihung nach Spielnr.)'!$B$2:$C$97,2)","v":{"$error":"#N/A"}},{"$f":"VLOOKUP(A41,'Meldung (Reihung nach Spielnr.)'!$B$2:$C$97,2)","v":{"$error":"#N/A"}}]
[{"$f":"Auslosung1!G41","v":0},{"$f":"Auslosung1!H41","v":{"$error":"#N/A"}},{"$f":"IF(F41+G41>0,IF(H41=\"OK\",IF(G41<F41,G41,100+(G41-F41)),0),0)","v":0},null,null,null,null,{"$f":"IF(OR(F41>=15,G41>=15),\"OK\",\"Fehlende oder falsche EIngabe\")","v":"Fehlende oder falsche EIngabe"}]
[{"$f":"Auslosung1!G42","v":0},{"$f":"Auslosung1!H42","v":{"$error":"#N/A"}},{"$f":"IF(F43+G43>0,IF(H43=\"OK\",IF(F43<G43,F43,100+(F43-G43)),0),0)","v":0},null,null,{"$f":"VLOOKUP(A42,'Meldung (Reihung nach Spielnr.)'!$B$2:$C$97,2)","v":{"$error":"#N/A"}},{"$f":"VLOOKUP(A43,'Meldung (Reihung nach Spielnr.)'!$B$2:$C$97,2)","v":{"$error":"#N/A"}}]
[{"$f":"Auslosung1!G43","v":0},{"$f":"Auslosung1!H43","v":{"$error":"#N/A"}},{"$f":"IF(F43+G43>0,IF(H43=\"OK\",IF(G43<F43,G43,100+(G43-F43)),0),0)","v":0},null,null,null,null,{"$f":"IF(OR(F43>=15,G43>=15),\"OK\",\"Fehlende oder falsche EIngabe\")","v":"Fehlende oder falsche EIngabe"}]
[{"$f":"Auslosung1!G44","v":0},{"$f":"Auslosung1!H44","v":{"$error":"#N/A"}},{"$f":"IF(F45+G45>0,IF(H45=\"OK\",IF(F45<G45,F45,100+(F45-G45)),0),0)","v":0},null,null,{"$f":"VLOOKUP(A44,'Meldung (Reihung nach Spielnr.)'!$B$2:$C$97,2)","v":{"$error":"#N/A"}},{"$f":"VLOOKUP(A45,'Meldung (Reihung nach Spielnr.)'!$B$2:$C$97,2)","v":{"$error":"#N/A"}}]
[{"$f":"Auslosung1!G45","v":0},{"$f":"Auslosung1!H45","v":{"$error":"#N/A"}},{"$f":"IF(F45+G45>0,IF(H45=\"OK\",IF(G45<F45,G45,100+(G45-F45)),0),0)","v":0},null,null,null,null,{"$f":"IF(OR(F45>=15,G45>=15),\"OK\",\"Fehlende oder falsche EIngabe\")","v":"Fehlende oder falsche EIngabe"}]
[{"$f":"Auslosung1!G46","v":0},{"$f":"Auslosung1!H46","v":{"$error":"#N/A"}},{"$f":"IF(F47+G47>0,IF(H47=\"OK\",IF(F47<G47,F47,100+(F47-G47)),0),0)","v":0},null,null,{"$f":"VLOOKUP(A46,'Meldung (Reihung nach Spielnr.)'!$B$2:$C$97,2)","v":{"$error":"#N/A"}},{"$f":"VLOOKUP(A47,'Meldung (Reihung nach Spielnr.)'!$B$2:$C$97,2)","v":{"$error":"#N/A"}}]
[{"$f":"Auslosung1!G47","v":0},{"$f":"Auslosung1!H47","v":{"$error":"#N/A"}},{"$f":"IF(F47+G47>0,IF(H47=\"OK\",IF(G47<F47,G47,100+(G47-F47)),0),0)","v":0},null,null,null,null,{"$f":"IF(OR(F47>=15,G47>=15),\"OK\",\"Fehlende oder falsche EIngabe\")","v":"Fehlende oder falsche EIngabe"}]
[{"$f":"Auslosung1!G48","v":0},{"$f":"Auslosung1!H48","v":{"$error":"#N/A"}},{"$f":"IF(F49+G49>0,IF(H49=\"OK\",IF(F49<G49,F49,100+(F49-G49)),0),0)","v":0},null,null,{"$f":"VLOOKUP(A48,'Meldung (Reihung nach Spielnr.)'!$B$2:$C$97,2)","v":{"$error":"#N/A"}},{"$f":"VLOOKUP(A49,'Meldung (Reihung nach Spielnr.)'!$B$2:$C$97,2)","v":{"$error":"#N/A"}}]
[{"$f":"Auslosung1!G49","v":0},{"$f":"Auslosung1!H49","v":{"$error":"#N/A"}},{"$f":"IF(F49+G49>0,IF(H49=\"OK\",IF(G49<F49,G49,100+(G49-F49)),0),0)","v":0},null,null,null,null,{"$f":"IF(OR(F49>=15,G49>=15),\"OK\",\"Fehlende oder falsche EIngabe\")","v":"Fehlende oder falsche EIngabe"}]
[{"$f":"Auslosung1!G50","v":0},{"$f":"Auslosung1!H50","v":{"$error":"#N/A"}},{"$f":"IF(F51+G51>0,IF(H51=\"OK\",IF(F51<G51,F51,100+(F51-G51)),0),0)","v":0},null,null,{"$f":"VLOOKUP(A50,'Meldung (Reihung nach Spielnr.)'!$B$2:$C$97,2)","v":{"$error":"#N/A"}},{"$f":"VLOOKUP(A51,'Meldung (Reihung nach Spielnr.)'!$B$2:$C$97,2)","v":{"$error":"#N/A"}}]
[{"$f":"Auslosung1!G51","v":0},{"$f":"Auslosung1!H51","v":{"$error":"#N/A"}},{"$f":"IF(F51+G51>0,IF(H51=\"OK\",IF(G51<F51,G51,100+(G51-F51)),0),0)","v":0},null,null,null,null,{"$f":"IF(OR(F51>=15,G51>=15),\"OK\",\"Fehlende oder falsche EIngabe\")","v":"Fehlende oder falsche EIngabe"}]
[{"$f":"Auslosung1!G52","v":0},{"$f":"Auslosung1!H52","v":{"$error":"#N/A"}},{"$f":"IF(F53+G53>0,IF(H53=\"OK\",IF(F53<G53,F53,100+(F53-G53)),0),0)","v":0},null,null,{"$f":"VLOOKUP(A52,'Meldung (Reihung nach Spielnr.)'!$B$2:$C$97,2)","v":{"$error":"#N/A"}},{"$f":"VLOOKUP(A53,'Meldung (Reihung nach Spielnr.)'!$B$2:$C$97,2)","v":{"$error":"#N/A"}}]
[{"$f":"Auslosung1!G53","v":0},{"$f":"Auslosung1!H53","v":{"$error":"#N/A"}},{"$f":"IF(F53+G53>0,IF(H53=\"OK\",IF(G53<F53,G53,100+(G53-F53)),0),0)","v":0},null,null,null,null,{"$f":"IF(OR(F53>=15,G53>=15),\"OK\",\"Fehlende oder falsche EIngabe\")","v":"Fehlende oder falsche EIngabe"}]
[{"$f":"Auslosung1!G54","v":0},{"$f":"Auslosung1!H54","v":{"$error":"#N/A"}},{"$f":"IF(F55+G55>0,IF(H55=\"OK\",IF(F55<G55,F55,100+(F55-G55)),0),0)","v":0},null,null,{"$f":"VLOOKUP(A54,'Meldung (Reihung nach Spielnr.)'!$B$2:$C$97,2)","v":{"$error":"#N/A"}},{"$f":"VLOOKUP(A55,'Meldung (Reihung nach Spielnr.)'!$B$2:$C$97,2)","v":{"$error":"#N/A"}}]
[{"$f":"Auslosung1!G55","v":0},{"$f":"Auslosung1!H55","v":{"$error":"#N/A"}},{"$f":"IF(F55+G55>0,IF(H55=\"OK\",IF(G55<F55,G55,100+(G55-F55)),0),0)","v":0},null,null,null,null,{"$f":"IF(OR(F55>=15,G55>=15),\"OK\",\"Fehlende oder falsche EIngabe\")","v":"Fehlende oder falsche EIngabe"}]
[{"$f":"Auslosung1!G56","v":0},{"$f":"Auslosung1!H56","v":{"$error":"#N/A"}},{"$f":"IF(F57+G57>0,IF(H57=\"OK\",IF(F57<G57,F57,100+(F57-G57)),0),0)","v":0},null,null,{"$f":"VLOOKUP(A56,'Meldung (Reihung nach Spielnr.)'!$B$2:$C$97,2)","v":{"$error":"#N/A"}},{"$f":"VLOOKUP(A57,'Meldung (Reihung nach Spielnr.)'!$B$2:$C$97,2)","v":{"$error":"#N/A"}}]
[{"$f":"Auslosung1!G57","v":0},{"$f":"Auslosung1!H57","v":{"$error":"#N/A"}},{"$f":"IF(F57+G57>0,IF(H57=\"OK\",IF(G57<F57,G57,100+(G57-F57)),0),0)","v":0},null,null,0,0,{"$f":"IF(OR(F57>=15,G57>=15),\"OK\",\"Fehlende oder falsche EIngabe\")","v":"Fehlende oder falsche EIngabe"}]
[{"$f":"Auslosung1!G58","v":0},{"$f":"Auslosung1!H58","v":{"$error":"#N/A"}},{"$f":"IF(F59+G59>0,IF(H59=\"OK\",IF(F59<G59,F59,100+(F59-G59)),0),0)","v":0},null,null,{"$f":"VLOOKUP(A58,'Meldung (Reihung nach Spielnr.)'!$B$2:$C$97,2)","v":{"$error":"#N/A"}},{"$f":"VLOOKUP(A59,'Meldung (Reihung nach Spielnr.)'!$B$2:$C$97,2)","v":{"$error":"#N/A"}}]
[{"$f":"Auslosung1!G59","v":0},{"$f":"Auslosung1!H59","v":{"$error":"#N/A"}},{"$f":"IF(F59+G59>0,IF(H59=\"OK\",IF(G59<F59,G59,100+(G59-F59)),0),0)","v":0},null,null,0,0,{"$f":"IF(OR(F59>=15,G59>=15),\"OK\",\"Fehlende oder falsche EIngabe\")","v":"Fehlende oder falsche EIngabe"}]
[{"$f":"Auslosung1!G60","v":0},{"$f":"Auslosung1!H60","v":{"$error":"#N/A"}},{"$f":"IF(F61+G61>0,IF(H61=\"OK\",IF(F61<G61,F61,100+(F61-G61)),0),0)","v":0},null,null,{"$f":"VLOOKUP(A60,'Meldung (Reihung nach Spielnr.)'!$B$2:$C$97,2)","v":{"$error":"#N/A"}},{"$f":"VLOOKUP(A61,'Meldung (Reihung nach Spielnr.)'!$B$2:$C$97,2)","v":{"$error":"#N/A"}}]
[{"$f":"Auslosung1!G61","v":0},{"$f":"Auslosung1!H61","v":{"$error":"#N/A"}},{"$f":"IF(F61+G61>0,IF(H61=\"OK\",IF(G61<F61,G61,100+(G61-F61)),0),0)","v":0},null,null,0,0,{"$f":"IF(OR(F61>=15,G61>=15),\"OK\",\"Fehlende oder falsche EIngabe\")","v":"Fehlende oder falsche EIngabe"}]
[{"$f":"Auslosung1!G62","v":0},{"$f":"Auslosung1!H62","v":{"$error":"#N/A"}},{"$f":"IF(F63+G63>0,IF(H63=\"OK\",IF(F63<G63,F63,100+(F63-G63)),0),0)","v":0},null,null,{"$f":"VLOOKUP(A62,'Meldung (Reihung nach Spielnr.)'!$B$2:$C$97,2)","v":{"$error":"#N/A"}},{"$f":"VLOOKUP(A63,'Meldung (Reihung nach Spielnr.)'!$B$2:$C$97,2)","v":{"$error":"#N/A"}}]
[{"$f":"Auslosung1!G63","v":0},{"$f":"Auslosung1!H63","v":{"$error":"#N/A"}},{"$f":"IF(F63+G63>0,IF(H63=\"OK\",IF(G63<F63,G63,100+(G63-F63)),0),0)","v":0},null,null,0,0,{"$f":"IF(OR(F63>=15,G63>=15),\"OK\",\"Fehlende oder falsche EIngabe\")","v":"Fehlende oder falsche EIngabe"}]
[{"$f":"Auslosung1!G64","v":0},{"$f":"Auslosung1!H64","v":{"$error":"#N/A"}},{"$f":"IF(F65+G65>0,IF(H65=\"OK\",IF(F65<G65,F65,100+(F65-G65)),0),0)","v":0},null,null,{"$f":"VLOOKUP(A64,'Meldung (Reihung nach Spielnr.)'!$B$2:$C$97,2)","v":{"$error":"#N/A"}},{"$f":"VLOOKUP(A65,'Meldung (Reihung nach Spielnr.)'!$B$2:$C$97,2)","v":{"$error":"#N/A"}}]
[{"$f":"Auslosung1!G65","v":0},{"$f":"Auslosung1!H65","v":{"$error":"#N/A"}},{"$f":"IF(F65+G65>0,IF(H65=\"OK\",IF(G65<F65,G65,100+(G65-F65)),0),0)","v":0},null,null,0,0,{"$f":"IF(OR(F65>=15,G65>=15),\"OK\",\"Fehlende oder falsche EIngabe\")","v":"Fehlende oder falsche EIngabe"}]
[{"$f":"Auslosung1!G66","v":0},{"$f":"Auslosung1!H66","v":{"$error":"#N/A"}},{"$f":"IF(F67+G67>0,IF(H67=\"OK\",IF(F67<G67,F67,100+(F67-G67)),0),0)","v":0},null,null,{"$f":"VLOOKUP(A66,'Meldung (Reihung nach Spielnr.)'!$B$2:$C$97,2)","v":{"$error":"#N/A"}},{"$f":"VLOOKUP(A67,'Meldung (Reihung nach Spielnr.)'!$B$2:$C$97,2)","v":{"$error":"#N/A"}}]
[{"$f":"Auslosung1!G67","v":0},{"$f":"Auslosung1!H67","v":{"$error":"#N/A"}},{"$f":"IF(F67+G67>0,IF(H67=\"OK\",IF(G67<F67,G67,100+(G67-F67)),0),0)","v":0},null,null,0,0,{"$f":"IF(OR(F67>=15,G67>=15),\"OK\",\"Fehlende oder falsche EIngabe\")","v":"Fehlende oder falsche EIngabe"}]
[{"$f":"Auslosung1!G68","v":0},{"$f":"Auslosung1!H68","v":{"$error":"#N/A"}},{"$f":"IF(F69+G69>0,IF(H69=\"OK\",IF(F69<G69,F69,100+(F69-G69)),0),0)","v":0},null,null,{"$f":"VLOOKUP(A68,'Meldung (Reihung nach Spielnr.)'!$B$2:$C$97,2)","v":{"$error":"#N/A"}},{"$f":"VLOOKUP(A69,'Meldung (Reihung nach Spielnr.)'!$B$2:$C$97,2)","v":{"$error":"#N/A"}}]
[{"$f":"Auslosung1!G69","v":0},{"$f":"Auslosung1!H69","v":{"$error":"#N/A"}},{"$f":"IF(F69+G69>0,IF(H69=\"OK\",IF(G69<F69,G69,100+(G69-F69)),0),0)","v":0},null,null,0,0,{"$f":"IF(OR(F69>=15,G69>=15),\"OK\",\"Fehlende oder falsche EIngabe\")","v":"Fehlende oder falsche EIngabe"}]
[{"$f":"Auslosung1!G70","v":0},{"$f":"Auslosung1!H70","v":{"$error":"#N/A"}},{"$f":"IF(F71+G71>0,IF(H71=\"OK\",IF(F71<G71,F71,100+(F71-G71)),0),0)","v":0},null,null,{"$f":"VLOOKUP(A70,'Meldung (Reihung nach Spielnr.)'!$B$2:$C$97,2)","v":{"$error":"#N/A"}},{"$f":"VLOOKUP(A71,'Meldung (Reihung nach Spielnr.)'!$B$2:$C$97,2)","v":{"$error":"#N/A"}}]
[{"$f":"Auslosung1!G71","v":0},{"$f":"Auslosung1!H71","v":{"$error":"#N/A"}},{"$f":"IF(F71+G71>0,IF(H71=\"OK\",IF(G71<F71,G71,100+(G71-F71)),0),0)","v":0},null,null,0,0,{"$f":"IF(OR(F71>=15,G71>=15),\"OK\",\"Fehlende oder falsche EIngabe\")","v":"Fehlende oder falsche EIngabe"}]
[{"$f":"Auslosung1!G72","v":0},{"$f":"Auslosung1!H72","v":{"$error":"#N/A"}},{"$f":"IF(F73+G73>0,IF(H73=\"OK\",IF(F73<G73,F73,100+(F73-G73)),0),0)","v":0},null,null,{"$f":"VLOOKUP(A72,'Meldung (Reihung nach Spielnr.)'!$B$2:$C$97,2)","v":{"$error":"#N/A"}},{"$f":"VLOOKUP(A73,'Meldung (Reihung nach Spielnr.)'!$B$2:$C$97,2)","v":{"$error":"#N/A"}}]
[{"$f":"Auslosung1!G73","v":0},{"$f":"Auslosung1!H73","v":{"$error":"#N/A"}},{"$f":"IF(F73+G73>0,IF(H73=\"OK\",IF(G73<F73,G73,100+(G73-F73)),0),0)","v":0},null,null,0,0,{"$f":"IF(OR(F73>=15,G73>=15),\"OK\",\"Fehlende oder falsche EIngabe\")","v":"Fehlende oder falsche EIngabe"}]
[{"$f":"Auslosung1!G74","v":0},{"$f":"Auslosung1!H74","v":{"$error":"#N/A"}},{"$f":"IF(F75+G75>0,IF(H75=\"OK\",IF(F75<G75,F75,100+(F75-G75)),0),0)","v":0},null,null,{"$f":"VLOOKUP(A74,'Meldung (Reihung nach Spielnr.)'!$B$2:$C$97,2)","v":{"$error":"#N/A"}},{"$f":"VLOOKUP(A75,'Meldung (Reihung nach Spielnr.)'!$B$2:$C$97,2)","v":{"$error":"#N/A"}}]
[{"$f":"Auslosung1!G75","v":0},{"$f":"Auslosung1!H75","v":{"$error":"#N/A"}},{"$f":"IF(F75+G75>0,IF(H75=\"OK\",IF(G75<F75,G75,100+(G75-F75)),0),0)","v":0},null,null,0,0,{"$f":"IF(OR(F75>=15,G75>=15),\"OK\",\"Fehlende oder falsche EIngabe\")","v":"Fehlende oder falsche EIngabe"}]
[{"$f":"Auslosung1!G76","v":0},{"$f":"Auslosung1!H76","v":{"$error":"#N/A"}},{"$f":"IF(F77+G77>0,IF(H77=\"OK\",IF(F77<G77,F77,100+(F77-G77)),0),0)","v":0},null,null,{"$f":"VLOOKUP(A76,'Meldung (Reihung nach Spielnr.)'!$B$2:$C$97,2)","v":{"$error":"#N/A"}},{"$f":"VLOOKUP(A77,'Meldung (Reihung nach Spielnr.)'!$B$2:$C$97,2)","v":{"$error":"#N/A"}}]
[{"$f":"Auslosung1!G77","v":0},{"$f":"Auslosung1!H77","v":{"$error":"#N/A"}},{"$f":"IF(F77+G77>0,IF(H77=\"OK\",IF(G77<F77,G77,100+(G77-F77)),0),0)","v":0},null,null,0,0,{"$f":"IF(OR(F77>=15,G77>=15),\"OK\",\"Fehlende oder falsche EIngabe\")","v":"Fehlende oder falsche EIngabe"}]
[{"$f":"Auslosung1!G78","v":0},{"$f":"Auslosung1!H78","v":{"$error":"#N/A"}},{"$f":"IF(F79+G79>0,IF(H79=\"OK\",IF(F79<G79,F79,100+(F79-G79)),0),0)","v":0},null,null,{"$f":"VLOOKUP(A78,'Meldung (Reihung nach Spielnr.)'!$B$2:$C$97,2)","v":{"$error":"#N/A"}},{"$f":"VLOOKUP(A79,'Meldung (Reihung nach Spielnr.)'!$B$2:$C$97,2)","v":{"$error":"#N/A"}}]
[{"$f":"Auslosung1!G79","v":0},{"$f":"Auslosung1!H79","v":{"$error":"#N/A"}},{"$f":"IF(F79+G79>0,IF(H79=\"OK\",IF(G79<F79,G79,100+(G79-F79)),0),0)","v":0},null,null,0,0,{"$f":"IF(OR(F79>=15,G79>=15),\"OK\",\"Fehlende oder falsche EIngabe\")","v":"Fehlende oder falsche EIngabe"}]
[{"$f":"Auslosung1!G80","v":0},{"$f":"Auslosung1!H80","v":{"$error":"#N/A"}},{"$f":"IF(F81+G81>0,IF(H81=\"OK\",IF(F81<G81,F81,100+(F81-G81)),0),0)","v":0},null,null,{"$f":"VLOOKUP(A80,'Meldung (Reihung nach Spielnr.)'!$B$2:$C$97,2)","v":{"$error":"#N/A"}},{"$f":"VLOOKUP(A81,'Meldung (Reihung nach Spielnr.)'!$B$2:$C$97,2)","v":{"$error":"#N/A"}}]
[{"$f":"Auslosung1!G81","v":0},{"$f":"Auslosung1!H81","v":{"$error":"#N/A"}},{"$f":"IF(F81+G81>0,IF(H81=\"OK\",IF(G81<F81,G81,100+(G81-F81)),0),0)","v":0},null,null,0,0,{"$f":"IF(OR(F81>=15,G81>=15),\"OK\",\"Fehlende oder falsche EIngabe\")","v":"Fehlende oder falsche EIngabe"}]
[{"$f":"Auslosung1!G82","v":0},{"$f":"Auslosung1!H82","v":{"$error":"#N/A"}},{"$f":"IF(F83+G83>0,IF(H83=\"OK\",IF(F83<G83,F83,100+(F83-G83)),0),0)","v":0},null,null,{"$f":"VLOOKUP(A82,'Meldung (Reihung nach Spielnr.)'!$B$2:$C$97,2)","v":{"$error":"#N/A"}},{"$f":"VLOOKUP(A83,'Meldung (Reihung nach Spielnr.)'!$B$2:$C$97,2)","v":{"$error":"#N/A"}}]
[{"$f":"Auslosung1!G83","v":0},{"$f":"Auslosung1!H83","v":{"$error":"#N/A"}},{"$f":"IF(F83+G83>0,IF(H83=\"OK\",IF(G83<F83,G83,100+(G83-F83)),0),0)","v":0},null,null,null,null,{"$f":"IF(OR(F83>=15,G83>=15),\"OK\",\"Fehlende oder falsche EIngabe\")","v":"Fehlende oder falsche EIngabe"}]
[{"$f":"Auslosung1!G84","v":0},{"$f":"Auslosung1!H84","v":{"$error":"#N/A"}},{"$f":"IF(F85+G85>0,IF(H85=\"OK\",IF(F85<G85,F85,100+(F85-G85)),0),0)","v":0},null,null,{"$f":"VLOOKUP(A84,'Meldung (Reihung nach Spielnr.)'!$B$2:$C$97,2)","v":{"$error":"#N/A"}},{"$f":"VLOOKUP(A85,'Meldung (Reihung nach Spielnr.)'!$B$2:$C$97,2)","v":{"$error":"#N/A"}}]
[{"$f":"Auslosung1!G85","v":0},{"$f":"Auslosung1!H85","v":{"$error":"#N/A"}},{"$f":"IF(F85+G85>0,IF(H85=\"OK\",IF(G85<F85,G85,100+(G85-F85)),0),0)","v":0},null,null,0,0,{"$f":"IF(OR(F85>=15,G85>=15),\"OK\",\"Fehlende oder falsche EIngabe\")","v":"Fehlende oder falsche EIngabe"}]
[{"$f":"Auslosung1!G86","v":0},{"$f":"Auslosung1!H86","v":{"$error":"#N/A"}},{"$f":"IF(F87+G87>0,IF(H87=\"OK\",IF(F87<G87,F87,100+(F87-G87)),0),0)","v":0},null,null,{"$f":"VLOOKUP(A86,'Meldung (Reihung nach Spielnr.)'!$B$2:$C$97,2)","v":{"$error":"#N/A"}},{"$f":"VLOOKUP(A87,'Meldung (Reihung nach Spielnr.)'!$B$2:$C$97,2)","v":{"$error":"#N/A"}}]
[{"$f":"Auslosung1!G87","v":0},{"$f":"Auslosung1!H87","v":{"$error":"#N/A"}},{"$f":"IF(F87+G87>0,IF(H87=\"OK\",IF(G87<F87,G87,100+(G87-F87)),0),0)","v":0},null,null,0,0,{"$f":"IF(OR(F87>=15,G87>=15),\"OK\",\"Fehlende oder falsche EIngabe\")","v":"Fehlende oder falsche EIngabe"}]
[{"$f":"Auslosung1!G88","v":0},{"$f":"Auslosung1!H88","v":{"$error":"#N/A"}},{"$f":"IF(F89+G89>0,IF(H89=\"OK\",IF(F89<G89,F89,100+(F89-G89)),0),0)","v":0},null,null,{"$f":"VLOOKUP(A88,'Meldung (Reihung nach Spielnr.)'!$B$2:$C$97,2)","v":{"$error":"#N/A"}},{"$f":"VLOOKUP(A89,'Meldung (Reihung nach Spielnr.)'!$B$2:$C$97,2)","v":{"$error":"#N/A"}}]
[{"$f":"Auslosung1!G89","v":0},{"$f":"Auslosung1!H89","v":{"$error":"#N/A"}},{"$f":"IF(F89+G89>0,IF(H89=\"OK\",IF(G89<F89,G89,100+(G89-F89)),0),0)","v":0},null,null,0,0,{"$f":"IF(OR(F89>=15,G89>=15),\"OK\",\"Fehlende oder falsche EIngabe\")","v":"Fehlende oder falsche EIngabe"}]
[{"$f":"Auslosung1!G90","v":0},{"$f":"Auslosung1!H90","v":{"$error":"#N/A"}},{"$f":"IF(F91+G91>0,IF(H91=\"OK\",IF(F91<G91,F91,100+(F91-G91)),0),0)","v":0},null,null,{"$f":"VLOOKUP(A90,'Meldung (Reihung nach Spielnr.)'!$B$2:$C$97,2)","v":{"$error":"#N/A"}},{"$f":"VLOOKUP(A91,'Meldung (Reihung nach Spielnr.)'!$B$2:$C$97,2)","v":{"$error":"#N/A"}}]
[{"$f":"Auslosung1!G91","v":0},{"$f":"Auslosung1!H91","v":{"$error":"#N/A"}},{"$f":"IF(F91+G91>0,IF(H91=\"OK\",IF(G91<F91,G91,100+(G91-F91)),0),0)","v":0},null,null,0,0,{"$f":"IF(OR(F91>=15,G91>=15),\"OK\",\"Fehlende oder falsche EIngabe\")","v":"Fehlende oder falsche EIngabe"}]
[{"$f":"Auslosung1!G92","v":0},{"$f":"Auslosung1!H92","v":{"$error":"#N/A"}},{"$f":"IF(F93+G93>0,IF(H93=\"OK\",IF(F93<G93,F93,100+(F93-G93)),0),0)","v":0},null,null,{"$f":"VLOOKUP(A92,'Meldung (Reihung nach Spielnr.)'!$B$2:$C$97,2)","v":{"$error":"#N/A"}},{"$f":"VLOOKUP(A93,'Meldung (Reihung nach Spielnr.)'!$B$2:$C$97,2)","v":{"$error":"#N/A"}}]
[{"$f":"Auslosung1!G93","v":0},{"$f":"Auslosung1!H93","v":{"$error":"#N/A"}},{"$f":"IF(F93+G93>0,IF(H93=\"OK\",IF(G93<F93,G93,100+(G93-F93)),0),0)","v":0},null,null,0,0,{"$f":"IF(OR(F93>=15,G93>=15),\"OK\",\"Fehlende oder falsche EIngabe\")","v":"Fehlende oder falsche EIngabe"}]
[{"$f":"Auslosung1!G94","v":0},{"$f":"Auslosung1!H94","v":{"$error":"#N/A"}},{"$f":"IF(F95+G95>0,IF(H95=\"OK\",IF(F95<G95,F95,100+(F95-G95)),0),0)","v":0},null,null,{"$f":"VLOOKUP(A94,'Meldung (Reihung nach Spielnr.)'!$B$2:$C$97,2)","v":{"$error":"#N/A"}},{"$f":"VLOOKUP(A95,'Meldung (Reihung nach Spielnr.)'!$B$2:$C$97,2)","v":{"$error":"#N/A"}}]
[{"$f":"Auslosung1!G95","v":0},{"$f":"Auslosung1!H95","v":{"$error":"#N/A"}},{"$f":"IF(F95+G95>0,IF(H95=\"OK\",IF(G95<F95,G95,100+(G95-F95)),0),0)","v":0},null,null,0,0,{"$f":"IF(OR(F95>=15,G95>=15),\"OK\",\"Fehlende oder falsche EIngabe\")","v":"Fehlende oder falsche EIngabe"}]
[{"$f":"Auslosung1!G96","v":0},{"$f":"Auslosung1!H96","v":{"$error":"#N/A"}},{"$f":"IF(F97+G97>0,IF(H97=\"OK\",IF(F97<G97,F97,100+(F97-G97)),0),0)","v":0},null,null,{"$f":"VLOOKUP(A96,'Meldung (Reihung nach Spielnr.)'!$B$2:$C$97,2)","v":{"$error":"#N/A"}},{"$f":"VLOOKUP(A97,'Meldung (Reihung nach Spielnr.)'!$B$2:$C$97,2)","v":{"$error":"#N/A"}}]
[{"$f":"Auslosung1!G97","v":0},{"$f":"Auslosung1!H97","v":{"$error":"#N/A"}},{"$f":"IF(F97+G97>0,IF(H97=\"OK\",IF(G97<F97,G97,100+(G97-F97)),0),0)","v":0},null,null,0,0,{"$f":"IF(OR(F97>=15,G97>=15),\"OK\",\"Fehlende oder falsche EIngabe\")","v":"Fehlende oder falsche EIngabe"}]
[null,null,{"$f":"IF(F99+G99>0,IF(H99=\"OK\",IF(F99<G99,F99,100+(F99-G99)),0),0)","v":0}]
[null,null,{"$f":"IF(F99+G99>0,IF(H99=\"OK\",IF(G99<F99,G99,100+(G99-F99)),0),0)","v":0}]

{"sheet":"Auslosung2","index":4,"n_rows":98,"n_cols":8,"rows_kept":98,"cut":false,"hidden":false,"merged":[]}
[12,"Geben Sie in die grüne Zelle, die Anzahl der Paare ein",null,null,"Zahl","TISCH","Spieler Nr.","Name"]
[4,20,null,null,1,1,{"$f":"A1","v":12},{"$f":"VLOOKUP(A1,'Meldung (Reihung nach Spielnr.)'!$B$2:$C$97,2)","v":"Heinrich Ebner u Erich Peer/Südtirol"}]
[1,null,null,null,2,1,{"$f":"A2","v":4},{"$f":"VLOOKUP(A2,'Meldung (Reihung nach Spielnr.)'!$B$2:$C$97,2)","v":"Andi Krajic u Peter Doblander/Tarrenz"}]
[20,null,null,null,3,2,1,{"$f":"VLOOKUP(A3,'Meldung (Reihung nach Spielnr.)'!$B$2:$C$97,2)","v":"Edi u Gerald/Telfs"}]
[11,null,null,null,4,2,20,{"$f":"VLOOKUP(A4,'Meldung (Reihung nach Spielnr.)'!$B$2:$C$97,2)","v":"Krissmer Reinhard | Fringer Fred"}]
[6,null,null,null,5,3,11,{"$f":"VLOOKUP(A5,'Meldung (Reihung nach Spielnr.)'!$B$2:$C$97,2)","v":"Heini Gruber u Gottfried Geier/Südtirol"}]
[15,null,null,null,6,3,6,{"$f":"VLOOKUP(A6,'Meldung (Reihung nach Spielnr.)'!$B$2:$C$97,2)","v":"Hans Perktold u Horst Friedl/Imst"}]
[3,null,null,null,7,4,15,{"$f":"VLOOKUP(A7,'Meldung (Reihung nach Spielnr.)'!$B$2:$C$97,2)","v":"Bernhard Meischberger u Martin Staggl/Kematen"}]
[13,null,null,null,8,4,3,{"$f":"VLOOKUP(A8,'Meldung (Reihung nach Spielnr.)'!$B$2:$C$97,2)","v":"Hubert Auer u Daniela Nöbauer/Telfs"}]
[5,null,null,null,9,5,13,{"$f":"VLOOKUP(A9,'Meldung (Reihung nach Spielnr.)'!$B$2:$C$97,2)","v":"Peter Auer u Stefan Sarg/Axams"}]
[2,null,null,null,10,5,5,{"$f":"VLOOKUP(A10,'Meldung (Reihung nach Spielnr.)'!$B$2:$C$97,2)","v":"Gerhard Schuler u Meinhard Eiter/Imst"}]
[18,null,null,null,11,6,2,{"$f":"VLOOKUP(A11,'Meldung (Reihung nach Spielnr.)'!$B$2:$C$97,2)","v":"Annette u Veronika/Telfs"}]
[10,null,null,null,12,6,18,{"$f":"VLOOKUP(A12,'Meldung (Reihung nach Spielnr.)'!$B$2:$C$97,2)","v":"Josef Eisenbeutl u Herbert Gamper/Imst"}]
[16,null,null,null,13,7,10,{"$f":"VLOOKUP(A13,'Meldung (Reihung nach Spielnr.)'!$B$2:$C$97,2)","v":"Franz Pellegrini u Hans Matha/Südtirol"}]
[19,null,null,null,14,7,16,{"$f":"VLOOKUP(A14,'Meldung (Reihung nach Spielnr.)'!$B$2:$C$97,2)","v":"Hermann Lechner u Andreas Oberacher/Kematen"}]
[7,null,null,null,15,8,19,{"$f":"VLOOKUP(A15,'Meldung (Reihung nach Spielnr.)'!$B$2:$C$97,2)","v":"Kurt Zebisch | Mr. Bean"}]
[17,null,null,null,16,8,7,{"$f":"VLOOKUP(A16,'Meldung (Reihung nach Spielnr.)'!$B$2:$C$97,2)","v":"Thomas Heltschl u Fredl Mungenast/Imst"}]
[8,null,null,null,17,9,17,{"$f":"VLOOKUP(A17,'Meldung (Reihung nach Spielnr.)'!$B$2:$C$97,2)","v":"Karin Logar u Rudolf Häusler/Kematen"}]
[9,null,null,null,18,9,8,{"$f":"VLOOKUP(A18,'Meldung (Reihung nach Spielnr.)'!$B$2:$C$97,2)","v":"Herbert Lechleitner u  Stefan Krabichler/Imst"}]
[14,null,null,null,19,10,9,{"$f":"VLOOKUP(A19,'Meldung (Reihung nach Spielnr.)'!$B$2:$C$97,2)","v":"Rudi Kastner u Peter Tschenett/Imst"}]
[null,"20 Paare = 10 Tische",null,null,20,10,14,{"$f":"VLOOKUP(A20,'Meldung (Reihung nach Spielnr.)'!$B$2:$C$97,2)","v":"Hansjörg Hell u Franz Braunegger/Axams"}]
[null,null,null,null,21,11,0,{"$f":"VLOOKUP(A21,'Meldung (Reihung nach Spielnr.)'!$B$2:$C$97,2)","v":{"$error":"#N/A"}}]
[null,null,null,null,22,11,0,{"$f":"VLOOKUP(A22,'Meldung (Reihung nach Spielnr.)'!$B$2:$C$97,2)","v":{"$error":"#N/A"}}]
[null,null,null,null,23,12,0,{"$f":"VLOOKUP(A23,'Meldung (Reihung nach Spielnr.)'!$B$2:$C$97,2)","v":{"$error":"#N/A"}}]
[null,null,null,null,24,12,0,{"$f":"VLOOKUP(A24,'Meldung (Reihung nach Spielnr.)'!$B$2:$C$97,2)","v":{"$error":"#N/A"}}]
[null,null,null,null,25,13,0,{"$f":"VLOOKUP(A25,'Meldung (Reihung nach Spielnr.)'!$B$2:$C$97,2)","v":{"$error":"#N/A"}}]
[null,null,null,null,26,13,0,{"$f":"VLOOKUP(A26,'Meldung (Reihung nach Spielnr.)'!$B$2:$C$97,2)","v":{"$error":"#N/A"}}]
[null,null,null,null,27,14,0,{"$f":"VLOOKUP(A27,'Meldung (Reihung nach Spielnr.)'!$B$2:$C$97,2)","v":{"$error":"#N/A"}}]
[null,null,null,null,28,14,0,{"$f":"VLOOKUP(A28,'Meldung (Reihung nach Spielnr.)'!$B$2:$C$97,2)","v":{"$error":"#N/A"}}]
[null,null,null,null,29,15,0,{"$f":"VLOOKUP(A29,'Meldung (Reihung nach Spielnr.)'!$B$2:$C$97,2)","v":{"$error":"#N/A"}}]
[null,null,null,null,30,15,0,{"$f":"VLOOKUP(A30,'Meldung (Reihung nach Spielnr.)'!$B$2:$C$97,2)","v":{"$error":"#N/A"}}]
[null,null,null,null,31,16,0,{"$f":"VLOOKUP(A31,'Meldung (Reihung nach Spielnr.)'!$B$2:$C$97,2)","v":{"$error":"#N/A"}}]
[null,null,null,null,32,16,0,{"$f":"VLOOKUP(A32,'Meldung (Reihung nach Spielnr.)'!$B$2:$C$97,2)","v":{"$error":"#N/A"}}]
[null,null,null,null,33,17,0,{"$f":"VLOOKUP(A33,'Meldung (Reihung nach Spielnr.)'!$B$2:$C$97,2)","v":{"$error":"#N/A"}}]
[null,null,null,null,34,17,0,{"$f":"VLOOKUP(A34,'Meldung (Reihung nach Spielnr.)'!$B$2:$C$97,2)","v":{"$error":"#N/A"}}]
[null,null,null,null,35,18,0,{"$f":"VLOOKUP(A35,'Meldung (Reihung nach Spielnr.)'!$B$2:$C$97,2)","v":{"$error":"#N/A"}}]
[null,null,null,null,36,18,0,{"$f":"VLOOKUP(A36,'Meldung (Reihung nach Spielnr.)'!$B$2:$C$97,2)","v":{"$error":"#N/A"}}]
[null,null,null,null,37,19,0,{"$f":"VLOOKUP(A37,'Meldung (Reihung nach Spielnr.)'!$B$2:$C$97,2)","v":{"$error":"#N/A"}}]
[null,null,null,null,38,19,0,{"$f":"VLOOKUP(A38,'Meldung (Reihung nach Spielnr.)'!$B$2:$C$97,2)","v":{"$error":"#N/A"}}]
[null,null,null,null,39,20,0,{"$f":"VLOOKUP(A39,'Meldung (Reihung nach Spielnr.)'!$B$2:$C$97,2)","v":{"$error":"#N/A"}}]
[null,null,null,null,40,20,0,{"$f":"VLOOKUP(A40,'Meldung (Reihung nach Spielnr.)'!$B$2:$C$97,2)","v":{"$error":"#N/A"}}]
[null,null,null,null,41,21,0,{"$f":"VLOOKUP(A41,'Meldung (Reihung nach Spielnr.)'!$B$2:$C$97,2)","v":{"$error":"#N/A"}}]
[null,null,null,null,42,21,0,{"$f":"VLOOKUP(A42,'Meldung (Reihung nach Spielnr.)'!$B$2:$C$97,2)","v":{"$error":"#N/A"}}]
[null,null,null,null,43,22,0,{"$f":"VLOOKUP(A43,'Meldung (Reihung nach Spielnr.)'!$B$2:$C$97,2)","v":{"$error":"#N/A"}}]
[null,null,null,null,44,22,0,{"$f":"VLOOKUP(A44,'Meldung (Reihung nach Spielnr.)'!$B$2:$C$97,2)","v":{"$error":"#N/A"}}]
[null,null,null,null,45,23,0,{"$f":"VLOOKUP(A45,'Meldung (Reihung nach Spielnr.)'!$B$2:$C$97,2)","v":{"$error":"#N/A"}}]
[null,null,null,null,46,23,0,{"$f":"VLOOKUP(A46,'Meldung (Reihung nach Spielnr.)'!$B$2:$C$97,2)","v":{"$error":"#N/A"}}]
[null,null,null,null,47,24,0,{"$f":"VLOOKUP(A47,'Meldung (Reihung nach Spielnr.)'!$B$2:$C$97,2)","v":{"$error":"#N/A"}}]
[null,null,null,null,48,24,0,{"$f":"VLOOKUP(A48,'Meldung (Reihung nach Spielnr.)'!$B$2:$C$97,2)","v":{"$error":"#N/A"}}]
[null,null,null,null,49,25,0,{"$f":"VLOOKUP(A49,'Meldung (Reihung nach Spielnr.)'!$B$2:$C$97,2)","v":{"$error":"#N/A"}}]
[null,null,null,null,50,25,0,{"$f":"VLOOKUP(A50,'Meldung (Reihung nach Spielnr.)'!$B$2:$C$97,2)","v":{"$error":"#N/A"}}]
[null,null,null,null,51,26,0,{"$f":"VLOOKUP(A51,'Meldung (Reihung nach Spielnr.)'!$B$2:$C$97,2)","v":{"$error":"#N/A"}}]
[null,null,null,null,52,26,0,{"$f":"VLOOKUP(A52,'Meldung (Reihung nach Spielnr.)'!$B$2:$C$97,2)","v":{"$error":"#N/A"}}]
[null,null,null,null,53,27,0,{"$f":"VLOOKUP(A53,'Meldung (Reihung nach Spielnr.)'!$B$2:$C$97,2)","v":{"$error":"#N/A"}}]
[null,null,null,null,54,27,0,{"$f":"VLOOKUP(A54,'Meldung (Reihung nach Spielnr.)'!$B$2:$C$97,2)","v":{"$error":"#N/A"}}]
[null,null,null,null,55,28,0,{"$f":"VLOOKUP(A55,'Meldung (Reihung nach Spielnr.)'!$B$2:$C$97,2)","v":{"$error":"#N/A"}}]
[null,null,null,null,56,28,0,{"$f":"VLOOKUP(A56,'Meldung (Reihung nach Spielnr.)'!$B$2:$C$97,2)","v":{"$error":"#N/A"}}]
[null,null,null,null,57,29,0,{"$f":"VLOOKUP(A57,'Meldung (Reihung nach Spielnr.)'!$B$2:$C$97,2)","v":{"$error":"#N/A"}}]
[null,null,null,null,58,29,0,{"$f":"VLOOKUP(A58,'Meldung (Reihung nach Spielnr.)'!$B$2:$C$97,2)","v":{"$error":"#N/A"}}]
[null,null,null,null,59,30,0,{"$f":"VLOOKUP(A59,'Meldung (Reihung nach Spielnr.)'!$B$2:$C$97,2)","v":{"$error":"#N/A"}}]
[null,null,null,null,60,30,0,{"$f":"VLOOKUP(A60,'Meldung (Reihung nach Spielnr.)'!$B$2:$C$97,2)","v":{"$error":"#N/A"}}]
[null,null,null,null,61,31,0,{"$f":"VLOOKUP(A61,'Meldung (Reihung nach Spielnr.)'!$B$2:$C$97,2)","v":{"$error":"#N/A"}}]
[null,null,null,null,62,31,0,{"$f":"VLOOKUP(A62,'Meldung (Reihung nach Spielnr.)'!$B$2:$C$97,2)","v":{"$error":"#N/A"}}]
[null,null,null,null,63,32,0,{"$f":"VLOOKUP(A63,'Meldung (Reihung nach Spielnr.)'!$B$2:$C$97,2)","v":{"$error":"#N/A"}}]
[null,null,null,null,64,32,0,{"$f":"VLOOKUP(A64,'Meldung (Reihung nach Spielnr.)'!$B$2:$C$97,2)","v":{"$error":"#N/A"}}]
[null,null,null,null,65,33,0,{"$f":"VLOOKUP(A65,'Meldung (Reihung nach Spielnr.)'!$B$2:$C$97,2)","v":{"$error":"#N/A"}}]
[null,null,null,null,66,33,{"$f":"A66","v":0},{"$f":"VLOOKUP(A66,'Meldung (Reihung nach Spielnr.)'!$B$2:$C$97,2)","v":{"$error":"#N/A"}}]
[null,null,null,null,67,17,0,{"$f":"VLOOKUP(A67,'Meldung (Reihung nach Spielnr.)'!$B$2:$C$97,2)","v":{"$error":"#N/A"}}]
[null,null,null,null,68,34,0,{"$f":"VLOOKUP(A68,'Meldung (Reihung nach Spielnr.)'!$B$2:$C$97,2)","v":{"$error":"#N/A"}}]
[null,null,null,null,69,34,0,{"$f":"VLOOKUP(A69,'Meldung (Reihung nach Spielnr.)'!$B$2:$C$97,2)","v":{"$error":"#N/A"}}]
[null,null,null,null,70,35,0,{"$f":"VLOOKUP(A70,'Meldung (Reihung nach Spielnr.)'!$B$2:$C$97,2)","v":{"$error":"#N/A"}}]
[null,null,null,null,71,35,0,{"$f":"VLOOKUP(A71,'Meldung (Reihung nach Spielnr.)'!$B$2:$C$97,2)","v":{"$error":"#N/A"}}]
[null,null,null,null,72,36,0,{"$f":"VLOOKUP(A72,'Meldung (Reihung nach Spielnr.)'!$B$2:$C$97,2)","v":{"$error":"#N/A"}}]
[null,null,null,null,73,36,0,{"$f":"VLOOKUP(A73,'Meldung (Reihung nach Spielnr.)'!$B$2:$C$97,2)","v":{"$error":"#N/A"}}]
[null,null,null,null,74,36,0,{"$f":"VLOOKUP(A74,'Meldung (Reihung nach Spielnr.)'!$B$2:$C$97,2)","v":{"$error":"#N/A"}}]
[null,null,null,null,75,37,0,{"$f":"VLOOKUP(A75,'Meldung (Reihung nach Spielnr.)'!$B$2:$C$97,2)","v":{"$error":"#N/A"}}]
[null,null,null,null,76,37,0,{"$f":"VLOOKUP(A76,'Meldung (Reihung nach Spielnr.)'!$B$2:$C$97,2)","v":{"$error":"#N/A"}}]
[null,null,null,null,77,38,0,{"$f":"VLOOKUP(A77,'Meldung (Reihung nach Spielnr.)'!$B$2:$C$97,2)","v":{"$error":"#N/A"}}]
[null,null,null,null,78,38,0,{"$f":"VLOOKUP(A78,'Meldung (Reihung nach Spielnr.)'!$B$2:$C$97,2)","v":{"$error":"#N/A"}}]
[null,null,null,null,79,39,0,{"$f":"VLOOKUP(A79,'Meldung (Reihung nach Spielnr.)'!$B$2:$C$97,2)","v":{"$error":"#N/A"}}]
[null,null,null,null,80,39,0,{"$f":"VLOOKUP(A80,'Meldung (Reihung nach Spielnr.)'!$B$2:$C$97,2)","v":{"$error":"#N/A"}}]
[null,null,null,null,81,40,0,{"$f":"VLOOKUP(A81,'Meldung (Reihung nach Spielnr.)'!$B$2:$C$97,2)","v":{"$error":"#N/A"}}]
[null,null,null,null,82,40,0,{"$f":"VLOOKUP(A82,'Meldung (Reihung nach Spielnr.)'!$B$2:$C$97,2)","v":{"$error":"#N/A"}}]
[null,null,null,null,83,41,0,{"$f":"VLOOKUP(A83,'Meldung (Reihung nach Spielnr.)'!$B$2:$C$97,2)","v":{"$error":"#N/A"}}]
[null,null,null,null,84,41,0,{"$f":"VLOOKUP(A84,'Meldung (Reihung nach Spielnr.)'!$B$2:$C$97,2)","v":{"$error":"#N/A"}}]
[null,null,null,null,85,42,0,{"$f":"VLOOKUP(A85,'Meldung (Reihung nach Spielnr.)'!$B$2:$C$97,2)","v":{"$error":"#N/A"}}]
[null,null,null,null,86,42,0,{"$f":"VLOOKUP(A86,'Meldung (Reihung nach Spielnr.)'!$B$2:$C$97,2)","v":{"$error":"#N/A"}}]
[null,null,null,null,87,43,0,{"$f":"VLOOKUP(A87,'Meldung (Reihung nach Spielnr.)'!$B$2:$C$97,2)","v":{"$error":"#N/A"}}]
[null,null,null,null,88,4,0,{"$f":"VLOOKUP(A88,'Meldung (Reihung nach Spielnr.)'!$B$2:$C$97,2)","v":{"$error":"#N/A"}}]
[null,null,null,null,89,44,0,{"$f":"VLOOKUP(A89,'Meldung (Reihung nach Spielnr.)'!$B$2:$C$97,2)","v":{"$error":"#N/A"}}]
[null,null,null,null,90,44,0,{"$f":"VLOOKUP(A90,'Meldung (Reihung nach Spielnr.)'!$B$2:$C$97,2)","v":{"$error":"#N/A"}}]
[null,null,null,null,91,45,0,{"$f":"VLOOKUP(A91,'Meldung (Reihung nach Spielnr.)'!$B$2:$C$97,2)","v":{"$error":"#N/A"}}]
[null,null,null,null,92,45,0,{"$f":"VLOOKUP(A92,'Meldung (Reihung nach Spielnr.)'!$B$2:$C$97,2)","v":{"$error":"#N/A"}}]
[null,null,null,null,93,46,0,{"$f":"VLOOKUP(A93,'Meldung (Reihung nach Spielnr.)'!$B$2:$C$97,2)","v":{"$error":"#N/A"}}]
[null,null,null,null,94,46,0,{"$f":"VLOOKUP(A94,'Meldung (Reihung nach Spielnr.)'!$B$2:$C$97,2)","v":{"$error":"#N/A"}}]
[null,null,null,null,95,47,0,{"$f":"VLOOKUP(A95,'Meldung (Reihung nach Spielnr.)'!$B$2:$C$97,2)","v":{"$error":"#N/A"}}]
[null,null,null,null,96,47,0,{"$f":"VLOOKUP(A96,'Meldung (Reihung nach Spielnr.)'!$B$2:$C$97,2)","v":{"$error":"#N/A"}}]
[null,null,null,null,96,47]

{"sheet":"Runde 2","index":5,"n_rows":97,"n_cols":8,"rows_kept":97,"cut":false,"hidden":false,"merged":[[0,3,0,4]]}
["Spielernr.","Name","Runde 2",null,null,"Punkte","Punkte",15]
[{"$f":"Auslosung2!G2","v":12},{"$f":"Auslosung2!H2","v":"Heinrich Ebner u Erich Peer/Südtirol"},{"$f":"IF(F3+G3>0,IF(H3=\"OK\",IF(F3<G3,F3,100+(F3-G3)),0),0)","v":0},null,null,{"$f":"VLOOKUP(A2,'Meldung (Reihung nach Spielnr.)'!$B$2:$C$97,2)","v":"Heinrich Ebner u Erich Peer/Südtirol"},{"$f":"VLOOKUP(A3,'Meldung (Reihung nach Spielnr.)'!$B$2:$C$97,2)","v":"Andi Krajic u Peter Doblander/Tarrenz"}]
[{"$f":"Auslosung2!G3","v":4},{"$f":"Auslosung2!H3","v":"Andi Krajic u Peter Doblander/Tarrenz"},{"$f":"IF(F3+G3>0,IF(H3=\"OK\",IF(G3<F3,G3,100+(G3-F3)),0),0)","v":0},null,null,null,null,{"$f":"IF(OR(F3>=15,G3>=15),\"OK\",\"Fehlende oder falsche EIngabe\")","v":"Fehlende oder falsche EIngabe"}]
[{"$f":"Auslosung2!G4","v":1},{"$f":"Auslosung2!H4","v":"Edi u Gerald/Telfs"},{"$f":"IF(F5+G5>0,IF(H5=\"OK\",IF(F5<G5,F5,100+(F5-G5)),0),0)","v":0},null,null,{"$f":"VLOOKUP(A4,'Meldung (Reihung nach Spielnr.)'!$B$2:$C$97,2)","v":"Edi u Gerald/Telfs"},{"$f":"VLOOKUP(A5,'Meldung (Reihung nach Spielnr.)'!$B$2:$C$97,2)","v":"Krissmer Reinhard | Fringer Fred"}]
[{"$f":"Auslosung2!G5","v":20},{"$f":"Auslosung2!H5","v":"Krissmer Reinhard | Fringer Fred"},{"$f":"IF(F5+G5>0,IF(H5=\"OK\",IF(G5<F5,G5,100+(G5-F5)),0),0)","v":0},null,null,null,null,{"$f":"IF(OR(F5>=15,G5>=15),\"OK\",\"Fehlende oder falsche EIngabe\")","v":"Fehlende oder falsche EIngabe"}]
[{"$f":"Auslosung2!G6","v":11},{"$f":"Auslosung2!H6","v":"Heini Gruber u Gottfried Geier/Südtirol"},{"$f":"IF(F7+G7>0,IF(H7=\"OK\",IF(F7<G7,F7,100+(F7-G7)),0),0)","v":0},null,null,{"$f":"VLOOKUP(A6,'Meldung (Reihung nach Spielnr.)'!$B$2:$C$97,2)","v":"Heini Gruber u Gottfried Geier/Südtirol"},{"$f":"VLOOKUP(A7,'Meldung (Reihung nach Spielnr.)'!$B$2:$C$97,2)","v":"Hans Perktold u Horst Friedl/Imst"}]
[{"$f":"Auslosung2!G7","v":6},{"$f":"Auslosung2!H7","v":"Hans Perktold u Horst Friedl/Imst"},{"$f":"IF(F7+G7>0,IF(H7=\"OK\",IF(G7<F7,G7,100+(G7-F7)),0),0)","v":0},null,null,null,null,{"$f":"IF(OR(F7>=15,G7>=15),\"OK\",\"Fehlende oder falsche EIngabe\")","v":"Fehlende oder falsche EIngabe"}]
[{"$f":"Auslosung2!G8","v":15},{"$f":"Auslosung2!H8","v":"Bernhard Meischberger u Martin Staggl/Kematen"},{"$f":"IF(F9+G9>0,IF(H9=\"OK\",IF(F9<G9,F9,100+(F9-G9)),0),0)","v":0},null,null,{"$f":"VLOOKUP(A8,'Meldung (Reihung nach Spielnr.)'!$B$2:$C$97,2)","v":"Bernhard Meischberger u Martin Staggl/Kematen"},{"$f":"VLOOKUP(A9,'Meldung (Reihung nach Spielnr.)'!$B$2:$C$97,2)","v":"Hubert Auer u Daniela Nöbauer/Telfs"}]
[{"$f":"Auslosung2!G9","v":3},{"$f":"Auslosung2!H9","v":"Hubert Auer u Daniela Nöbauer/Telfs"},{"$f":"IF(F9+G9>0,IF(H9=\"OK\",IF(G9<F9,G9,100+(G9-F9)),0),0)","v":0},null,null,null,null,{"$f":"IF(OR(F9>=15,G9>=15),\"OK\",\"Fehlende oder falsche EIngabe\")","v":"Fehlende oder falsche EIngabe"}]
[{"$f":"Auslosung2!G10","v":13},{"$f":"Auslosung2!H10","v":"Peter Auer u Stefan Sarg/Axams"},{"$f":"IF(F11+G11>0,IF(H11=\"OK\",IF(F11<G11,F11,100+(F11-G11)),0),0)","v":0},null,null,{"$f":"VLOOKUP(A10,'Meldung (Reihung nach Spielnr.)'!$B$2:$C$97,2)","v":"Peter Auer u Stefan Sarg/Axams"},{"$f":"VLOOKUP(A11,'Meldung (Reihung nach Spielnr.)'!$B$2:$C$97,2)","v":"Gerhard Schuler u Meinhard Eiter/Imst"}]
[{"$f":"Auslosung2!G11","v":5},{"$f":"Auslosung2!H11","v":"Gerhard Schuler u Meinhard Eiter/Imst"},{"$f":"IF(F11+G11>0,IF(H11=\"OK\",IF(G11<F11,G11,100+(G11-F11)),0),0)","v":0},null,null,null,null,{"$f":"IF(OR(F11>=15,G11>=15),\"OK\",\"Fehlende oder falsche EIngabe\")","v":"Fehlende oder falsche EIngabe"}]
[{"$f":"Auslosung2!G12","v":2},{"$f":"Auslosung2!H12","v":"Annette u Veronika/Telfs"},{"$f":"IF(F13+G13>0,IF(H13=\"OK\",IF(F13<G13,F13,100+(F13-G13)),0),0)","v":0},null,null,{"$f":"VLOOKUP(A12,'Meldung (Reihung nach Spielnr.)'!$B$2:$C$97,2)","v":"Annette u Veronika/Telfs"},{"$f":"VLOOKUP(A13,'Meldung (Reihung nach Spielnr.)'!$B$2:$C$97,2)","v":"Josef Eisenbeutl u Herbert Gamper/Imst"}]
[{"$f":"Auslosung2!G13","v":18},{"$f":"Auslosung2!H13","v":"Josef Eisenbeutl u Herbert Gamper/Imst"},{"$f":"IF(F13+G13>0,IF(H13=\"OK\",IF(G13<F13,G13,100+(G13-F13)),0),0)","v":0},null,null,null,null,{"$f":"IF(OR(F13>=15,G13>=15),\"OK\",\"Fehlende oder falsche EIngabe\")","v":"Fehlende oder falsche EIngabe"}]
[{"$f":"Auslosung2!G14","v":10},{"$f":"Auslosung2!H14","v":"Franz Pellegrini u Hans Matha/Südtirol"},{"$f":"IF(F15+G15>0,IF(H15=\"OK\",IF(F15<G15,F15,100+(F15-G15)),0),0)","v":0},null,null,{"$f":"VLOOKUP(A14,'Meldung (Reihung nach Spielnr.)'!$B$2:$C$97,2)","v":"Franz Pellegrini u Hans Matha/Südtirol"},{"$f":"VLOOKUP(A15,'Meldung (Reihung nach Spielnr.)'!$B$2:$C$97,2)","v":"Hermann Lechner u Andreas Oberacher/Kematen"}]
[{"$f":"Auslosung2!G15","v":16},{"$f":"Auslosung2!H15","v":"Hermann Lechner u Andreas Oberacher/Kematen"},{"$f":"IF(F15+G15>0,IF(H15=\"OK\",IF(G15<F15,G15,100+(G15-F15)),0),0)","v":0},null,null,null,null,{"$f":"IF(OR(F15>=15,G15>=15),\"OK\",\"Fehlende oder falsche EIngabe\")","v":"Fehlende oder falsche EIngabe"}]
[{"$f":"Auslosung2!G16","v":19},{"$f":"Auslosung2!H16","v":"Kurt Zebisch | Mr. Bean"},{"$f":"IF(F17+G17>0,IF(H17=\"OK\",IF(F17<G17,F17,100+(F17-G17)),0),0)","v":0},null,null,{"$f":"VLOOKUP(A16,'Meldung (Reihung nach Spielnr.)'!$B$2:$C$97,2)","v":"Kurt Zebisch | Mr. Bean"},{"$f":"VLOOKUP(A17,'Meldung (Reihung nach Spielnr.)'!$B$2:$C$97,2)","v":"Thomas Heltschl u Fredl Mungenast/Imst"}]
[{"$f":"Auslosung2!G17","v":7},{"$f":"Auslosung2!H17","v":"Thomas Heltschl u Fredl Mungenast/Imst"},{"$f":"IF(F17+G17>0,IF(H17=\"OK\",IF(G17<F17,G17,100+(G17-F17)),0),0)","v":0},null,null,null,null,{"$f":"IF(OR(F17>=15,G17>=15),\"OK\",\"Fehlende oder falsche EIngabe\")","v":"Fehlende oder falsche EIngabe"}]
[{"$f":"Auslosung2!G18","v":17},{"$f":"Auslosung2!H18","v":"Karin Logar u Rudolf Häusler/Kematen"},{"$f":"IF(F19+G19>0,IF(H19=\"OK\",IF(F19<G19,F19,100+(F19-G19)),0),0)","v":0},null,null,{"$f":"VLOOKUP(A18,'Meldung (Reihung nach Spielnr.)'!$B$2:$C$97,2)","v":"Karin Logar u Rudolf Häusler/Kematen"},{"$f":"VLOOKUP(A19,'Meldung (Reihung nach Spielnr.)'!$B$2:$C$97,2)","v":"Herbert Lechleitner u  Stefan Krabichler/Imst"}]
[{"$f":"Auslosung2!G19","v":8},{"$f":"Auslosung2!H19","v":"Herbert Lechleitner u  Stefan Krabichler/Imst"},{"$f":"IF(F19+G19>0,IF(H19=\"OK\",IF(G19<F19,G19,100+(G19-F19)),0),0)","v":0},null,null,null,null,{"$f":"IF(OR(F19>=15,G19>=15),\"OK\",\"Fehlende oder falsche EIngabe\")","v":"Fehlende oder falsche EIngabe"}]
[{"$f":"Auslosung2!G20","v":9},{"$f":"Auslosung2!H20","v":"Rudi Kastner u Peter Tschenett/Imst"},{"$f":"IF(F21+G21>0,IF(H21=\"OK\",IF(F21<G21,F21,100+(F21-G21)),0),0)","v":0},null,null,{"$f":"VLOOKUP(A20,'Meldung (Reihung nach Spielnr.)'!$B$2:$C$97,2)","v":"Rudi Kastner u Peter Tschenett/Imst"},{"$f":"VLOOKUP(A21,'Meldung (Reihung nach Spielnr.)'!$B$2:$C$97,2)","v":"Hansjörg Hell u Franz Braunegger/Axams"}]
[{"$f":"Auslosung2!G21","v":14},{"$f":"Auslosung2!H21","v":"Hansjörg Hell u Franz Braunegger/Axams"},{"$f":"IF(F21+G21>0,IF(H21=\"OK\",IF(G21<F21,G21,100+(G21-F21)),0),0)","v":0},null,null,null,null,{"$f":"IF(OR(F21>=15,G21>=15),\"OK\",\"Fehlende oder falsche EIngabe\")","v":"Fehlende oder falsche EIngabe"}]
[{"$f":"Auslosung2!G22","v":0},{"$f":"Auslosung2!H22","v":{"$error":"#N/A"}},{"$f":"IF(F23+G23>0,IF(H23=\"OK\",IF(F23<G23,F23,100+(F23-G23)),0),0)","v":0},null,null,{"$f":"VLOOKUP(A22,'Meldung (Reihung nach Spielnr.)'!$B$2:$C$97,2)","v":{"$error":"#N/A"}},{"$f":"VLOOKUP(A23,'Meldung (Reihung nach Spielnr.)'!$B$2:$C$97,2)","v":{"$error":"#N/A"}}]
[{"$f":"Auslosung2!G23","v":0},{"$f":"Auslosung2!H23","v":{"$error":"#N/A"}},{"$f":"IF(F23+G23>0,IF(H23=\"OK\",IF(G23<F23,G23,100+(G23-F23)),0),0)","v":0},null,null,null,null,{"$f":"IF(OR(F23>=15,G23>=15),\"OK\",\"Fehlende oder falsche EIngabe\")","v":"Fehlende oder falsche EIngabe"}]
[{"$f":"Auslosung2!G24","v":0},{"$f":"Auslosung2!H24","v":{"$error":"#N/A"}},{"$f":"IF(F25+G25>0,IF(H25=\"OK\",IF(F25<G25,F25,100+(F25-G25)),0),0)","v":0},null,null,{"$f":"VLOOKUP(A24,'Meldung (Reihung nach Spielnr.)'!$B$2:$C$97,2)","v":{"$error":"#N/A"}},{"$f":"VLOOKUP(A25,'Meldung (Reihung nach Spielnr.)'!$B$2:$C$97,2)","v":{"$error":"#N/A"}}]
[{"$f":"Auslosung2!G25","v":0},{"$f":"Auslosung2!H25","v":{"$error":"#N/A"}},{"$f":"IF(F25+G25>0,IF(H25=\"OK\",IF(G25<F25,G25,100+(G25-F25)),0),0)","v":0},null,null,null,null,{"$f":"IF(OR(F25>=15,G25>=15),\"OK\",\"Fehlende oder falsche EIngabe\")","v":"Fehlende oder falsche EIngabe"}]
[{"$f":"Auslosung2!G26","v":0},{"$f":"Auslosung2!H26","v":{"$error":"#N/A"}},{"$f":"IF(F27+G27>0,IF(H27=\"OK\",IF(F27<G27,F27,100+(F27-G27)),0),0)","v":0},null,null,{"$f":"VLOOKUP(A26,'Meldung (Reihung nach Spielnr.)'!$B$2:$C$97,2)","v":{"$error":"#N/A"}},{"$f":"VLOOKUP(A27,'Meldung (Reihung nach Spielnr.)'!$B$2:$C$97,2)","v":{"$error":"#N/A"}}]
[{"$f":"Auslosung2!G27","v":0},{"$f":"Auslosung2!H27","v":{"$error":"#N/A"}},{"$f":"IF(F27+G27>0,IF(H27=\"OK\",IF(G27<F27,G27,100+(G27-F27)),0),0)","v":0},null,null,null,null,{"$f":"IF(OR(F27>=15,G27>=15),\"OK\",\"Fehlende oder falsche EIngabe\")","v":"Fehlende oder falsche EIngabe"}]
[{"$f":"Auslosung2!G28","v":0},{"$f":"Auslosung2!H28","v":{"$error":"#N/A"}},{"$f":"IF(F29+G29>0,IF(H29=\"OK\",IF(F29<G29,F29,100+(F29-G29)),0),0)","v":0},null,null,{"$f":"VLOOKUP(A28,'Meldung (Reihung nach Spielnr.)'!$B$2:$C$97,2)","v":{"$error":"#N/A"}},{"$f":"VLOOKUP(A29,'Meldung (Reihung nach Spielnr.)'!$B$2:$C$97,2)","v":{"$error":"#N/A"}}]
[{"$f":"Auslosung2!G29","v":0},{"$f":"Auslosung2!H29","v":{"$error":"#N/A"}},{"$f":"IF(F29+G29>0,IF(H29=\"OK\",IF(G29<F29,G29,100+(G29-F29)),0),0)","v":0},null,null,null,null,{"$f":"IF(OR(F29>=15,G29>=15),\"OK\",\"Fehlende oder falsche EIngabe\")","v":"Fehlende oder falsche EIngabe"}]
[{"$f":"Auslosung2!G30","v":0},{"$f":"Auslosung2!H30","v":{"$error":"#N/A"}},{"$f":"IF(F31+G31>0,IF(H31=\"OK\",IF(F31<G31,F31,100+(F31-G31)),0),0)","v":0},null,null,{"$f":"VLOOKUP(A30,'Meldung (Reihung nach Spielnr.)'!$B$2:$C$97,2)","v":{"$error":"#N/A"}},{"$f":"VLOOKUP(A31,'Meldung (Reihung nach Spielnr.)'!$B$2:$C$97,2)","v":{"$error":"#N/A"}}]
[{"$f":"Auslosung2!G31","v":0},{"$f":"Auslosung2!H31","v":{"$error":"#N/A"}},{"$f":"IF(F31+G31>0,IF(H31=\"OK\",IF(G31<F31,G31,100+(G31-F31)),0),0)","v":0},null,null,null,null,{"$f":"IF(OR(F31>=15,G31>=15),\"OK\",\"Fehlende oder falsche EIngabe\")","v":"Fehlende oder falsche EIngabe"}]
[{"$f":"Auslosung2!G32","v":0},{"$f":"Auslosung2!H32","v":{"$error":"#N/A"}},{"$f":"IF(F33+G33>0,IF(H33=\"OK\",IF(F33<G33,F33,100+(F33-G33)),0),0)","v":0},null,null,{"$f":"VLOOKUP(A32,'Meldung (Reihung nach Spielnr.)'!$B$2:$C$97,2)","v":{"$error":"#N/A"}},{"$f":"VLOOKUP(A33,'Meldung (Reihung nach Spielnr.)'!$B$2:$C$97,2)","v":{"$error":"#N/A"}}]
[{"$f":"Auslosung2!G33","v":0},{"$f":"Auslosung2!H33","v":{"$error":"#N/A"}},{"$f":"IF(F33+G33>0,IF(H33=\"OK\",IF(G33<F33,G33,100+(G33-F33)),0),0)","v":0},null,null,null,null,{"$f":"IF(OR(F33>=15,G33>=15),\"OK\",\"Fehlende oder falsche EIngabe\")","v":"Fehlende oder falsche EIngabe"}]
[{"$f":"Auslosung2!G34","v":0},{"$f":"Auslosung2!H34","v":{"$error":"#N/A"}},{"$f":"IF(F35+G35>0,IF(H35=\"OK\",IF(F35<G35,F35,100+(F35-G35)),0),0)","v":0},null,null,{"$f":"VLOOKUP(A34,'Meldung (Reihung nach Spielnr.)'!$B$2:$C$97,2)","v":{"$error":"#N/A"}},{"$f":"VLOOKUP(A35,'Meldung (Reihung nach Spielnr.)'!$B$2:$C$97,2)","v":{"$error":"#N/A"}}]
[{"$f":"Auslosung2!G35","v":0},{"$f":"Auslosung2!H35","v":{"$error":"#N/A"}},{"$f":"IF(F35+G35>0,IF(H35=\"OK\",IF(G35<F35,G35,100+(G35-F35)),0),0)","v":0},null,null,null,null,{"$f":"IF(OR(F35>=15,G35>=15),\"OK\",\"Fehlende oder falsche EIngabe\")","v":"Fehlende oder falsche EIngabe"}]
[{"$f":"Auslosung2!G36","v":0},{"$f":"Auslosung2!H36","v":{"$error":"#N/A"}},{"$f":"IF(F37+G37>0,IF(H37=\"OK\",IF(F37<G37,F37,100+(F37-G37)),0),0)","v":0},null,null,{"$f":"VLOOKUP(A36,'Meldung (Reihung nach Spielnr.)'!$B$2:$C$97,2)","v":{"$error":"#N/A"}},{"$f":"VLOOKUP(A37,'Meldung (Reihung nach Spielnr.)'!$B$2:$C$97,2)","v":{"$error":"#N/A"}}]
[{"$f":"Auslosung2!G37","v":0},{"$f":"Auslosung2!H37","v":{"$error":"#N/A"}},{"$f":"IF(F37+G37>0,IF(H37=\"OK\",IF(G37<F37,G37,100+(G37-F37)),0),0)","v":0},null,null,null,null,{"$f":"IF(OR(F37>=15,G37>=15),\"OK\",\"Fehlende oder falsche EIngabe\")","v":"Fehlende oder falsche EIngabe"}]
[{"$f":"Auslosung2!G38","v":0},{"$f":"Auslosung2!H38","v":{"$error":"#N/A"}},{"$f":"IF(F39+G39>0,IF(H39=\"OK\",IF(F39<G39,F39,100+(F39-G39)),0),0)","v":0},null,null,{"$f":"VLOOKUP(A38,'Meldung (Reihung nach Spielnr.)'!$B$2:$C$97,2)","v":{"$error":"#N/A"}},{"$f":"VLOOKUP(A39,'Meldung (Reihung nach Spielnr.)'!$B$2:$C$97,2)","v":{"$error":"#N/A"}}]
[{"$f":"Auslosung2!G39","v":0},{"$f":"Auslosung2!H39","v":{"$error":"#N/A"}},{"$f":"IF(F39+G39>0,IF(H39=\"OK\",IF(G39<F39,G39,100+(G39-F39)),0),0)","v":0},null,null,null,null,{"$f":"IF(OR(F39>=15,G39>=15),\"OK\",\"Fehlende oder falsche EIngabe\")","v":"Fehlende oder falsche EIngabe"}]
[{"$f":"Auslosung2!G40","v":0},{"$f":"Auslosung2!H40","v":{"$error":"#N/A"}},{"$f":"IF(F41+G41>0,IF(H41=\"OK\",IF(F41<G41,F41,100+(F41-G41)),0),0)","v":0},null,null,{"$f":"VLOOKUP(A40,'Meldung (Reihung nach Spielnr.)'!$B$2:$C$97,2)","v":{"$error":"#N/A"}},{"$f":"VLOOKUP(A41,'Meldung (Reihung nach Spielnr.)'!$B$2:$C$97,2)","v":{"$error":"#N/A"}}]
[{"$f":"Auslosung2!G41","v":0},{"$f":"Auslosung2!H41","v":{"$error":"#N/A"}},{"$f":"IF(F41+G41>0,IF(H41=\"OK\",IF(G41<F41,G41,100+(G41-F41)),0),0)","v":0},null,null,null,null,{"$f":"IF(OR(F41>=15,G41>=15),\"OK\",\"Fehlende oder falsche EIngabe\")","v":"Fehlende oder falsche EIngabe"}]
[{"$f":"Auslosung2!G42","v":0},{"$f":"Auslosung2!H42","v":{"$error":"#N/A"}},{"$f":"IF(D42=15,100+(D42-E42),IF(D42<15,D42,100+(D42-E42)))","v":0}]
[{"$f":"Auslosung2!G43","v":0},{"$f":"Auslosung2!H43","v":{"$error":"#N/A"}},0]
[{"$f":"Auslosung2!G44","v":0},{"$f":"Auslosung2!H44","v":{"$error":"#N/A"}},0]
[{"$f":"Auslosung2!G45","v":0},{"$f":"Auslosung2!H45","v":{"$error":"#N/A"}},0]
[{"$f":"Auslosung2!G46","v":0},{"$f":"Auslosung2!H46","v":{"$error":"#N/A"}},0]
[{"$f":"Auslosung2!G47","v":0},{"$f":"Auslosung2!H47","v":{"$error":"#N/A"}},0]
[{"$f":"Auslosung2!G48","v":0},{"$f":"Auslosung2!H48","v":{"$error":"#N/A"}},0]
[{"$f":"Auslosung2!G49","v":0},{"$f":"Auslosung2!H49","v":{"$error":"#N/A"}},0]
[{"$f":"Auslosung2!G50","v":0},{"$f":"Auslosung2!H50","v":{"$error":"#N/A"}},0]
[{"$f":"Auslosung2!G51","v":0},{"$f":"Auslosung2!H51","v":{"$error":"#N/A"}},0]
[{"$f":"Auslosung2!G52","v":0},{"$f":"Auslosung2!H52","v":{"$error":"#N/A"}},0]
[{"$f":"Auslosung2!G53","v":0},{"$f":"Auslosung2!H53","v":{"$error":"#N/A"}},0]
[{"$f":"Auslosung2!G54","v":0},{"$f":"Auslosung2!H54","v":{"$error":"#N/A"}},0]
[{"$f":"Auslosung2!G55","v":0},{"$f":"Auslosung2!H55","v":{"$error":"#N/A"}},0]
[{"$f":"Auslosung2!G56","v":0},{"$f":"Auslosung2!H56","v":{"$error":"#N/A"}},0]
[{"$f":"Auslosung2!G57","v":0},{"$f":"Auslosung2!H57","v":{"$error":"#N/A"}},0]
[{"$f":"Auslosung2!G58","v":0},{"$f":"Auslosung2!H58","v":{"$error":"#N/A"}},0]
[{"$f":"Auslosung2!G59","v":0},{"$f":"Auslosung2!H59","v":{"$error":"#N/A"}},0]
[{"$f":"Auslosung2!G60","v":0},{"$f":"Auslosung2!H60","v":{"$error":"#N/A"}},0]
[{"$f":"Auslosung2!G61","v":0},{"$f":"Auslosung2!H61","v":{"$error":"#N/A"}},0]
[{"$f":"Auslosung2!G62","v":0},{"$f":"Auslosung2!H62","v":{"$error":"#N/A"}},0]
[{"$f":"Auslosung2!G63","v":0},{"$f":"Auslosung2!H63","v":{"$error":"#N/A"}},0]
[{"$f":"Auslosung2!G64","v":0},{"$f":"Auslosung2!H64","v":{"$error":"#N/A"}},0]
[{"$f":"Auslosung2!G65","v":0},{"$f":"Auslosung2!H65","v":{"$error":"#N/A"}},0]
[{"$f":"Auslosung2!G66","v":0},{"$f":"Auslosung2!H66","v":{"$error":"#N/A"}},0]
[{"$f":"Auslosung2!G67","v":0},{"$f":"Auslosung2!H67","v":{"$error":"#N/A"}},{"$f":"IF(D67=15,100+(D67-E67),IF(D67<15,D67,100+(D67-E67)))","v":0}]
[{"$f":"Auslosung2!G68","v":0},{"$f":"Auslosung2!H68","v":{"$error":"#N/A"}},0]
[{"$f":"Auslosung2!G69","v":0},{"$f":"Auslosung2!H69","v":{"$error":"#N/A"}},0]
[{"$f":"Auslosung2!G70","v":0},{"$f":"Auslosung2!H70","v":{"$error":"#N/A"}},0]
[{"$f":"Auslosung2!G71","v":0},{"$f":"Auslosung2!H71","v":{"$error":"#N/A"}},0]
[{"$f":"Auslosung2!G72","v":0},{"$f":"Auslosung2!H72","v":{"$error":"#N/A"}},0]
[{"$f":"Auslosung2!G73","v":0},{"$f":"Auslosung2!H73","v":{"$error":"#N/A"}},0]
[{"$f":"Auslosung2!G74","v":0},{"$f":"Auslosung2!H74","v":{"$error":"#N/A"}},0]
[{"$f":"Auslosung2!G75","v":0},{"$f":"Auslosung2!H75","v":{"$error":"#N/A"}},0]
[{"$f":"Auslosung2!G76","v":0},{"$f":"Auslosung2!H76","v":{"$error":"#N/A"}},0]
[{"$f":"Auslosung2!G77","v":0},{"$f":"Auslosung2!H77","v":{"$error":"#N/A"}},0]
[{"$f":"Auslosung2!G78","v":0},{"$f":"Auslosung2!H78","v":{"$error":"#N/A"}},0]
[{"$f":"Auslosung2!G79","v":0},{"$f":"Auslosung2!H79","v":{"$error":"#N/A"}},0]
[{"$f":"Auslosung2!G80","v":0},{"$f":"Auslosung2!H80","v":{"$error":"#N/A"}},0]
[{"$f":"Auslosung2!G81","v":0},{"$f":"Auslosung2!H81","v":{"$error":"#N/A"}},0]
[{"$f":"Auslosung2!G82","v":0},{"$f":"Auslosung2!H82","v":{"$error":"#N/A"}},0]
[{"$f":"Auslosung2!G83","v":0},{"$f":"Auslosung2!H83","v":{"$error":"#N/A"}},0]
[{"$f":"Auslosung2!G84","v":0},{"$f":"Auslosung2!H84","v":{"$error":"#N/A"}},0]
[{"$f":"Auslosung2!G85","v":0},{"$f":"Auslosung2!H85","v":{"$error":"#N/A"}},0]
[{"$f":"Auslosung2!G86","v":0},{"$f":"Auslosung2!H86","v":{"$error":"#N/A"}},0]
[{"$f":"Auslosung2!G87","v":0},{"$f":"Auslosung2!H87","v":{"$error":"#N/A"}},0]
[{"$f":"Auslosung2!G88","v":0},{"$f":"Auslosung2!H88","v":{"$error":"#N/A"}},0]
[{"$f":"Auslosung2!G89","v":0},{"$f":"Auslosung2!H89","v":{"$error":"#N/A"}},0]
[{"$f":"Auslosung2!G90","v":0},{"$f":"Auslosung2!H90","v":{"$error":"#N/A"}},0]
[{"$f":"Auslosung2!G91","v":0},{"$f":"Auslosung2!H91","v":{"$error":"#N/A"}},0]
[{"$f":"Auslosung2!G92","v":0},{"$f":"Auslosung2!H92","v":{"$error":"#N/A"}},0]
[{"$f":"Auslosung2!G93","v":0},{"$f":"Auslosung2!H93","v":{"$error":"#N/A"}},0]
[{"$f":"Auslosung2!G94","v":0},{"$f":"Auslosung2!H94","v":{"$error":"#N/A"}},0]
[{"$f":"Auslosung2!G95","v":0},{"$f":"Auslosung2!H95","v":{"$error":"#N/A"}},0]
[{"$f":"Auslosung2!G96","v":0},{"$f":"Auslosung2!H96","v":{"$error":"#N/A"}},0]
[{"$f":"Auslosung2!G97","v":0},{"$f":"Auslosung2!H97","v":{"$error":"#N/A"}},0]

{"sheet":"Auslosung3","index":6,"n_rows":97,"n_cols":8,"rows_kept":97,"cut":false,"hidden":false,"merged":[]}
[4,"Geben Sie in die grüne Zelle, die Anzahl der Paare ein",null,null,"Zahl","TISCH","Spieler Nr.","Name"]
[14,20,null,null,1,1,{"$f":"A1","v":4},{"$f":"VLOOKUP(A1,'Meldung (Reihung nach Spielnr.)'!$B$2:$C$97,2)","v":"Andi Krajic u Peter Doblander/Tarrenz"}]
[12,{"$f":"'Meldung (Reihung nach Spielnr.)'!M1","v":20},null,null,2,1,{"$f":"A2","v":14},{"$f":"VLOOKUP(A2,'Meldung (Reihung nach Spielnr.)'!$B$2:$C$97,2)","v":"Hansjörg Hell u Franz Braunegger/Axams"}]
[9,null,null,null,3,2,12,{"$f":"VLOOKUP(A3,'Meldung (Reihung nach Spielnr.)'!$B$2:$C$97,2)","v":"Heinrich Ebner u Erich Peer/Südtirol"}]
[10,null,null,null,4,2,9,{"$f":"VLOOKUP(A4,'Meldung (Reihung nach Spielnr.)'!$B$2:$C$97,2)","v":"Rudi Kastner u Peter Tschenett/Imst"}]
[17,null,null,null,5,3,10,{"$f":"VLOOKUP(A5,'Meldung (Reihung nach Spielnr.)'!$B$2:$C$97,2)","v":"Franz Pellegrini u Hans Matha/Südtirol"}]
[3,null,null,null,6,3,17,{"$f":"VLOOKUP(A6,'Meldung (Reihung nach Spielnr.)'!$B$2:$C$97,2)","v":"Karin Logar u Rudolf Häusler/Kematen"}]
[1,null,null,null,7,4,3,{"$f":"VLOOKUP(A7,'Meldung (Reihung nach Spielnr.)'!$B$2:$C$97,2)","v":"Hubert Auer u Daniela Nöbauer/Telfs"}]
[6,null,null,null,8,4,1,{"$f":"VLOOKUP(A8,'Meldung (Reihung nach Spielnr.)'!$B$2:$C$97,2)","v":"Edi u Gerald/Telfs"}]
[7,null,null,null,9,5,6,{"$f":"VLOOKUP(A9,'Meldung (Reihung nach Spielnr.)'!$B$2:$C$97,2)","v":"Hans Perktold u Horst Friedl/Imst"}]
[5,null,null,null,10,5,7,{"$f":"VLOOKUP(A10,'Meldung (Reihung nach Spielnr.)'!$B$2:$C$97,2)","v":"Thomas Heltschl u Fredl Mungenast/Imst"}]
[15,null,null,null,11,6,5,{"$f":"VLOOKUP(A11,'Meldung (Reihung nach Spielnr.)'!$B$2:$C$97,2)","v":"Gerhard Schuler u Meinhard Eiter/Imst"}]
[20,null,null,null,12,6,15,{"$f":"VLOOKUP(A12,'Meldung (Reihung nach Spielnr.)'!$B$2:$C$97,2)","v":"Bernhard Meischberger u Martin Staggl/Kematen"}]
[13,null,null,null,13,7,20,{"$f":"VLOOKUP(A13,'Meldung (Reihung nach Spielnr.)'!$B$2:$C$97,2)","v":"Krissmer Reinhard | Fringer Fred"}]
[8,null,null,null,14,7,13,{"$f":"VLOOKUP(A14,'Meldung (Reihung nach Spielnr.)'!$B$2:$C$97,2)","v":"Peter Auer u Stefan Sarg/Axams"}]
[19,null,null,null,15,8,8,{"$f":"VLOOKUP(A15,'Meldung (Reihung nach Spielnr.)'!$B$2:$C$97,2)","v":"Herbert Lechleitner u  Stefan Krabichler/Imst"}]
[16,null,null,null,16,8,19,{"$f":"VLOOKUP(A16,'Meldung (Reihung nach Spielnr.)'!$B$2:$C$97,2)","v":"Kurt Zebisch | Mr. Bean"}]
[2,null,null,null,17,9,16,{"$f":"VLOOKUP(A17,'Meldung (Reihung nach Spielnr.)'!$B$2:$C$97,2)","v":"Hermann Lechner u Andreas Oberacher/Kematen"}]
[18,null,null,null,18,9,2,{"$f":"VLOOKUP(A18,'Meldung (Reihung nach Spielnr.)'!$B$2:$C$97,2)","v":"Annette u Veronika/Telfs"}]
[11,null,null,null,19,10,18,{"$f":"VLOOKUP(A19,'Meldung (Reihung nach Spielnr.)'!$B$2:$C$97,2)","v":"Josef Eisenbeutl u Herbert Gamper/Imst"}]
[null,null,null,null,20,10,11,{"$f":"VLOOKUP(A20,'Meldung (Reihung nach Spielnr.)'!$B$2:$C$97,2)","v":"Heini Gruber u Gottfried Geier/Südtirol"}]
[null,null,null,null,21,11,0,{"$f":"VLOOKUP(A21,'Meldung (Reihung nach Spielnr.)'!$B$2:$C$97,2)","v":{"$error":"#N/A"}}]
[null,null,null,null,22,11,0,{"$f":"VLOOKUP(A22,'Meldung (Reihung nach Spielnr.)'!$B$2:$C$97,2)","v":{"$error":"#N/A"}}]
[null,null,null,null,23,12,0,{"$f":"VLOOKUP(A23,'Meldung (Reihung nach Spielnr.)'!$B$2:$C$97,2)","v":{"$error":"#N/A"}}]
[null,null,null,null,24,12,0,{"$f":"VLOOKUP(A24,'Meldung (Reihung nach Spielnr.)'!$B$2:$C$97,2)","v":{"$error":"#N/A"}}]
[null,null,null,null,25,13,0,{"$f":"VLOOKUP(A25,'Meldung (Reihung nach Spielnr.)'!$B$2:$C$97,2)","v":{"$error":"#N/A"}}]
[null,null,null,null,26,13,0,{"$f":"VLOOKUP(A26,'Meldung (Reihung nach Spielnr.)'!$B$2:$C$97,2)","v":{"$error":"#N/A"}}]
[null,null,null,null,27,14,0,{"$f":"VLOOKUP(A27,'Meldung (Reihung nach Spielnr.)'!$B$2:$C$97,2)","v":{"$error":"#N/A"}}]
[null,null,null,null,28,14,0,{"$f":"VLOOKUP(A28,'Meldung (Reihung nach Spielnr.)'!$B$2:$C$97,2)","v":{"$error":"#N/A"}}]
[null,null,null,null,29,15,0,{"$f":"VLOOKUP(A29,'Meldung (Reihung nach Spielnr.)'!$B$2:$C$97,2)","v":{"$error":"#N/A"}}]
[null,null,null,null,30,15,0,{"$f":"VLOOKUP(A30,'Meldung (Reihung nach Spielnr.)'!$B$2:$C$97,2)","v":{"$error":"#N/A"}}]
[null,null,null,null,31,16,0,{"$f":"VLOOKUP(A31,'Meldung (Reihung nach Spielnr.)'!$B$2:$C$97,2)","v":{"$error":"#N/A"}}]
[null,null,null,null,32,16,0,{"$f":"VLOOKUP(A32,'Meldung (Reihung nach Spielnr.)'!$B$2:$C$97,2)","v":{"$error":"#N/A"}}]
[null,null,null,null,33,17,0,{"$f":"VLOOKUP(A33,'Meldung (Reihung nach Spielnr.)'!$B$2:$C$97,2)","v":{"$error":"#N/A"}}]
[null,null,null,null,34,17,0,{"$f":"VLOOKUP(A34,'Meldung (Reihung nach Spielnr.)'!$B$2:$C$97,2)","v":{"$error":"#N/A"}}]
[null,null,null,null,35,18,0,{"$f":"VLOOKUP(A35,'Meldung (Reihung nach Spielnr.)'!$B$2:$C$97,2)","v":{"$error":"#N/A"}}]
[null,null,null,null,36,18,0,{"$f":"VLOOKUP(A36,'Meldung (Reihung nach Spielnr.)'!$B$2:$C$97,2)","v":{"$error":"#N/A"}}]
[null,null,null,null,37,19,0,{"$f":"VLOOKUP(A37,'Meldung (Reihung nach Spielnr.)'!$B$2:$C$97,2)","v":{"$error":"#N/A"}}]
[null,null,null,null,38,19,0,{"$f":"VLOOKUP(A38,'Meldung (Reihung nach Spielnr.)'!$B$2:$C$97,2)","v":{"$error":"#N/A"}}]
[null,null,null,null,39,20,0,{"$f":"VLOOKUP(A39,'Meldung (Reihung nach Spielnr.)'!$B$2:$C$97,2)","v":{"$error":"#N/A"}}]
[null,null,null,null,40,20,0,{"$f":"VLOOKUP(A40,'Meldung (Reihung nach Spielnr.)'!$B$2:$C$97,2)","v":{"$error":"#N/A"}}]
[null,null,null,null,41,21,0,{"$f":"VLOOKUP(A41,'Meldung (Reihung nach Spielnr.)'!$B$2:$C$97,2)","v":{"$error":"#N/A"}}]
[null,null,null,null,42,21,0,{"$f":"VLOOKUP(A42,'Meldung (Reihung nach Spielnr.)'!$B$2:$C$97,2)","v":{"$error":"#N/A"}}]
[null,null,null,null,43,22,0,{"$f":"VLOOKUP(A43,'Meldung (Reihung nach Spielnr.)'!$B$2:$C$97,2)","v":{"$error":"#N/A"}}]
[null,null,null,null,44,22,0,{"$f":"VLOOKUP(A44,'Meldung (Reihung nach Spielnr.)'!$B$2:$C$97,2)","v":{"$error":"#N/A"}}]
[null,null,null,null,45,23,0,{"$f":"VLOOKUP(A45,'Meldung (Reihung nach Spielnr.)'!$B$2:$C$97,2)","v":{"$error":"#N/A"}}]
[null,null,null,null,46,23,0,{"$f":"VLOOKUP(A46,'Meldung (Reihung nach Spielnr.)'!$B$2:$C$97,2)","v":{"$error":"#N/A"}}]
[null,null,null,null,47,24,0,{"$f":"VLOOKUP(A47,'Meldung (Reihung nach Spielnr.)'!$B$2:$C$97,2)","v":{"$error":"#N/A"}}]
[null,null,null,null,48,24,0,{"$f":"VLOOKUP(A48,'Meldung (Reihung nach Spielnr.)'!$B$2:$C$97,2)","v":{"$error":"#N/A"}}]
[null,null,null,null,49,25,0,{"$f":"VLOOKUP(A49,'Meldung (Reihung nach Spielnr.)'!$B$2:$C$97,2)","v":{"$error":"#N/A"}}]
[null,null,null,null,50,25,0,{"$f":"VLOOKUP(A50,'Meldung (Reihung nach Spielnr.)'!$B$2:$C$97,2)","v":{"$error":"#N/A"}}]
[null,null,null,null,51,26,0,{"$f":"VLOOKUP(A51,'Meldung (Reihung nach Spielnr.)'!$B$2:$C$97,2)","v":{"$error":"#N/A"}}]
[null,null,null,null,52,26,0,{"$f":"VLOOKUP(A52,'Meldung (Reihung nach Spielnr.)'!$B$2:$C$97,2)","v":{"$error":"#N/A"}}]
[null,null,null,null,53,27,0,{"$f":"VLOOKUP(A53,'Meldung (Reihung nach Spielnr.)'!$B$2:$C$97,2)","v":{"$error":"#N/A"}}]
[null,null,null,null,54,27,0,{"$f":"VLOOKUP(A54,'Meldung (Reihung nach Spielnr.)'!$B$2:$C$97,2)","v":{"$error":"#N/A"}}]
[null,null,null,null,55,28,0,{"$f":"VLOOKUP(A55,'Meldung (Reihung nach Spielnr.)'!$B$2:$C$97,2)","v":{"$error":"#N/A"}}]
[null,null,null,null,56,28,0,{"$f":"VLOOKUP(A56,'Meldung (Reihung nach Spielnr.)'!$B$2:$C$97,2)","v":{"$error":"#N/A"}}]
[null,null,null,null,57,29,0,{"$f":"VLOOKUP(A57,'Meldung (Reihung nach Spielnr.)'!$B$2:$C$97,2)","v":{"$error":"#N/A"}}]
[null,null,null,null,58,29,0,{"$f":"VLOOKUP(A58,'Meldung (Reihung nach Spielnr.)'!$B$2:$C$97,2)","v":{"$error":"#N/A"}}]
[null,null,null,null,59,30,0,{"$f":"VLOOKUP(A59,'Meldung (Reihung nach Spielnr.)'!$B$2:$C$97,2)","v":{"$error":"#N/A"}}]
[null,null,null,null,60,30,0,{"$f":"VLOOKUP(A60,'Meldung (Reihung nach Spielnr.)'!$B$2:$C$97,2)","v":{"$error":"#N/A"}}]
[null,null,null,null,61,31,0,{"$f":"VLOOKUP(A61,'Meldung (Reihung nach Spielnr.)'!$B$2:$C$97,2)","v":{"$error":"#N/A"}}]
[null,null,null,null,62,31,0,{"$f":"VLOOKUP(A62,'Meldung (Reihung nach Spielnr.)'!$B$2:$C$97,2)","v":{"$error":"#N/A"}}]
[null,null,null,null,63,32,0,{"$f":"VLOOKUP(A63,'Meldung (Reihung nach Spielnr.)'!$B$2:$C$97,2)","v":{"$error":"#N/A"}}]
[null,null,null,null,64,32,0,{"$f":"VLOOKUP(A64,'Meldung (Reihung nach Spielnr.)'!$B$2:$C$97,2)","v":{"$error":"#N/A"}}]
[null,null,null,null,65,33,0,{"$f":"VLOOKUP(A65,'Meldung (Reihung nach Spielnr.)'!$B$2:$C$97,2)","v":{"$error":"#N/A"}}]
[null,null,null,null,66,33,{"$f":"A66","v":0},{"$f":"VLOOKUP(A66,'Meldung (Reihung nach Spielnr.)'!$B$2:$C$97,2)","v":{"$error":"#N/A"}}]
[null,null,null,null,67,17,0,{"$f":"VLOOKUP(A67,'Meldung (Reihung nach Spielnr.)'!$B$2:$C$97,2)","v":{"$error":"#N/A"}}]
[null,null,null,null,68,34,0,{"$f":"VLOOKUP(A68,'Meldung (Reihung nach Spielnr.)'!$B$2:$C$97,2)","v":{"$error":"#N/A"}}]
[null,null,null,null,69,34,0,{"$f":"VLOOKUP(A69,'Meldung (Reihung nach Spielnr.)'!$B$2:$C$97,2)","v":{"$error":"#N/A"}}]
[null,null,null,null,70,35,0,{"$f":"VLOOKUP(A70,'Meldung (Reihung nach Spielnr.)'!$B$2:$C$97,2)","v":{"$error":"#N/A"}}]
[null,null,null,null,71,35,0,{"$f":"VLOOKUP(A71,'Meldung (Reihung nach Spielnr.)'!$B$2:$C$97,2)","v":{"$error":"#N/A"}}]
[null,null,null,null,72,36,0,{"$f":"VLOOKUP(A72,'Meldung (Reihung nach Spielnr.)'!$B$2:$C$97,2)","v":{"$error":"#N/A"}}]
[null,null,null,null,73,36,0,{"$f":"VLOOKUP(A73,'Meldung (Reihung nach Spielnr.)'!$B$2:$C$97,2)","v":{"$error":"#N/A"}}]
[null,null,null,null,74,36,0,{"$f":"VLOOKUP(A74,'Meldung (Reihung nach Spielnr.)'!$B$2:$C$97,2)","v":{"$error":"#N/A"}}]
[null,null,null,null,75,37,0,{"$f":"VLOOKUP(A75,'Meldung (Reihung nach Spielnr.)'!$B$2:$C$97,2)","v":{"$error":"#N/A"}}]
[null,null,null,null,76,37,0,{"$f":"VLOOKUP(A76,'Meldung (Reihung nach Spielnr.)'!$B$2:$C$97,2)","v":{"$error":"#N/A"}}]
[null,null,null,null,77,38,0,{"$f":"VLOOKUP(A77,'Meldung (Reihung nach Spielnr.)'!$B$2:$C$97,2)","v":{"$error":"#N/A"}}]
[null,null,null,null,78,38,0,{"$f":"VLOOKUP(A78,'Meldung (Reihung nach Spielnr.)'!$B$2:$C$97,2)","v":{"$error":"#N/A"}}]
[null,null,null,null,79,39,0,{"$f":"VLOOKUP(A79,'Meldung (Reihung nach Spielnr.)'!$B$2:$C$97,2)","v":{"$error":"#N/A"}}]
[null,null,null,null,80,39,0,{"$f":"VLOOKUP(A80,'Meldung (Reihung nach Spielnr.)'!$B$2:$C$97,2)","v":{"$error":"#N/A"}}]
[null,null,null,null,81,40,0,{"$f":"VLOOKUP(A81,'Meldung (Reihung nach Spielnr.)'!$B$2:$C$97,2)","v":{"$error":"#N/A"}}]
[null,null,null,null,82,40,0,{"$f":"VLOOKUP(A82,'Meldung (Reihung nach Spielnr.)'!$B$2:$C$97,2)","v":{"$error":"#N/A"}}]
[null,null,null,null,83,41,0,{"$f":"VLOOKUP(A83,'Meldung (Reihung nach Spielnr.)'!$B$2:$C$97,2)","v":{"$error":"#N/A"}}]
[null,null,null,null,84,41,0,{"$f":"VLOOKUP(A84,'Meldung (Reihung nach Spielnr.)'!$B$2:$C$97,2)","v":{"$error":"#N/A"}}]
[null,null,null,null,85,42,0,{"$f":"VLOOKUP(A85,'Meldung (Reihung nach Spielnr.)'!$B$2:$C$97,2)","v":{"$error":"#N/A"}}]
[null,null,null,null,86,42,0,{"$f":"VLOOKUP(A86,'Meldung (Reihung nach Spielnr.)'!$B$2:$C$97,2)","v":{"$error":"#N/A"}}]
[null,null,null,null,87,43,0,{"$f":"VLOOKUP(A87,'Meldung (Reihung nach Spielnr.)'!$B$2:$C$97,2)","v":{"$error":"#N/A"}}]
[null,null,null,null,88,4,0,{"$f":"VLOOKUP(A88,'Meldung (Reihung nach Spielnr.)'!$B$2:$C$97,2)","v":{"$error":"#N/A"}}]
[null,null,null,null,89,44,0,{"$f":"VLOOKUP(A89,'Meldung (Reihung nach Spielnr.)'!$B$2:$C$97,2)","v":{"$error":"#N/A"}}]
[null,null,null,null,90,44,0,{"$f":"VLOOKUP(A90,'Meldung (Reihung nach Spielnr.)'!$B$2:$C$97,2)","v":{"$error":"#N/A"}}]
[null,null,null,null,91,45,0,{"$f":"VLOOKUP(A91,'Meldung (Reihung nach Spielnr.)'!$B$2:$C$97,2)","v":{"$error":"#N/A"}}]
[null,null,null,null,92,45,0,{"$f":"VLOOKUP(A92,'Meldung (Reihung nach Spielnr.)'!$B$2:$C$97,2)","v":{"$error":"#N/A"}}]
[null,null,null,null,93,46,0,{"$f":"VLOOKUP(A93,'Meldung (Reihung nach Spielnr.)'!$B$2:$C$97,2)","v":{"$error":"#N/A"}}]
[null,null,null,null,94,46,0,{"$f":"VLOOKUP(A94,'Meldung (Reihung nach Spielnr.)'!$B$2:$C$97,2)","v":{"$error":"#N/A"}}]
[null,null,null,null,95,47,0,{"$f":"VLOOKUP(A95,'Meldung (Reihung nach Spielnr.)'!$B$2:$C$97,2)","v":{"$error":"#N/A"}}]
[null,null,null,null,96,47,0,{"$f":"VLOOKUP(A96,'Meldung (Reihung nach Spielnr.)'!$B$2:$C$97,2)","v":{"$error":"#N/A"}}]

{"sheet":"Runde 3","index":7,"n_rows":97,"n_cols":8,"rows_kept":97,"cut":false,"hidden":false,"merged":[[0,3,0,4]]}
["Paar Nr","Name","Runde 3","Ergebnis",null,"Punkte","Punkte",15]
[{"$f":"Auslosung3!G2","v":4},{"$f":"Auslosung3!H2","v":"Andi Krajic u Peter Doblander/Tarrenz"},{"$f":"IF(F3+G3>0,IF(H3=\"OK\",IF(F3<G3,F3,100+(F3-G3)),0),0)","v":0},null,null,{"$f":"VLOOKUP(A2,'Meldung (Reihung nach Spielnr.)'!$B$2:$C$97,2)","v":"Andi Krajic u Peter Doblander/Tarrenz"},{"$f":"VLOOKUP(A3,'Meldung (Reihung nach Spielnr.)'!$B$2:$C$97,2)","v":"Hansjörg Hell u Franz Braunegger/Axams"}]
[{"$f":"Auslosung3!G3","v":14},{"$f":"Auslosung3!H3","v":"Hansjörg Hell u Franz Braunegger/Axams"},{"$f":"IF(F3+G3>0,IF(H3=\"OK\",IF(G3<F3,G3,100+(G3-F3)),0),0)","v":0},null,null,null,0,{"$f":"IF(OR(F3>=15,G3>=15),\"OK\",\"Fehlende oder falsche EIngabe\")","v":"Fehlende oder falsche EIngabe"}]
[{"$f":"Auslosung3!G4","v":12},{"$f":"Auslosung3!H4","v":"Heinrich Ebner u Erich Peer/Südtirol"},{"$f":"IF(F5+G5>0,IF(H5=\"OK\",IF(F5<G5,F5,100+(F5-G5)),0),0)","v":0},null,null,{"$f":"VLOOKUP(A4,'Meldung (Reihung nach Spielnr.)'!$B$2:$C$97,2)","v":"Heinrich Ebner u Erich Peer/Südtirol"},{"$f":"VLOOKUP(A5,'Meldung (Reihung nach Spielnr.)'!$B$2:$C$97,2)","v":"Rudi Kastner u Peter Tschenett/Imst"}]
[{"$f":"Auslosung3!G5","v":9},{"$f":"Auslosung3!H5","v":"Rudi Kastner u Peter Tschenett/Imst"},{"$f":"IF(F5+G5>0,IF(H5=\"OK\",IF(G5<F5,G5,100+(G5-F5)),0),0)","v":0},null,null,null,0,{"$f":"IF(OR(F5>=15,G5>=15),\"OK\",\"Fehlende oder falsche EIngabe\")","v":"Fehlende oder falsche EIngabe"}]
[{"$f":"Auslosung3!G6","v":10},{"$f":"Auslosung3!H6","v":"Franz Pellegrini u Hans Matha/Südtirol"},{"$f":"IF(F7+G7>0,IF(H7=\"OK\",IF(F7<G7,F7,100+(F7-G7)),0),0)","v":0},null,null,{"$f":"VLOOKUP(A6,'Meldung (Reihung nach Spielnr.)'!$B$2:$C$97,2)","v":"Franz Pellegrini u Hans Matha/Südtirol"},{"$f":"VLOOKUP(A7,'Meldung (Reihung nach Spielnr.)'!$B$2:$C$97,2)","v":"Karin Logar u Rudolf Häusler/Kematen"}]
[{"$f":"Auslosung3!G7","v":17},{"$f":"Auslosung3!H7","v":"Karin Logar u Rudolf Häusler/Kematen"},{"$f":"IF(F7+G7>0,IF(H7=\"OK\",IF(G7<F7,G7,100+(G7-F7)),0),0)","v":0},null,null,null,0,{"$f":"IF(OR(F7>=15,G7>=15),\"OK\",\"Fehlende oder falsche EIngabe\")","v":"Fehlende oder falsche EIngabe"}]
[{"$f":"Auslosung3!G8","v":3},{"$f":"Auslosung3!H8","v":"Hubert Auer u Daniela Nöbauer/Telfs"},{"$f":"IF(F9+G9>0,IF(H9=\"OK\",IF(F9<G9,F9,100+(F9-G9)),0),0)","v":0},null,null,{"$f":"VLOOKUP(A8,'Meldung (Reihung nach Spielnr.)'!$B$2:$C$97,2)","v":"Hubert Auer u Daniela Nöbauer/Telfs"},{"$f":"VLOOKUP(A9,'Meldung (Reihung nach Spielnr.)'!$B$2:$C$97,2)","v":"Edi u Gerald/Telfs"}]
[{"$f":"Auslosung3!G9","v":1},{"$f":"Auslosung3!H9","v":"Edi u Gerald/Telfs"},{"$f":"IF(F9+G9>0,IF(H9=\"OK\",IF(G9<F9,G9,100+(G9-F9)),0),0)","v":0},null,null,null,null,{"$f":"IF(OR(F9>=15,G9>=15),\"OK\",\"Fehlende oder falsche EIngabe\")","v":"Fehlende oder falsche EIngabe"}]
[{"$f":"Auslosung3!G10","v":6},{"$f":"Auslosung3!H10","v":"Hans Perktold u Horst Friedl/Imst"},{"$f":"IF(F11+G11>0,IF(H11=\"OK\",IF(F11<G11,F11,100+(F11-G11)),0),0)","v":0},null,null,{"$f":"VLOOKUP(A10,'Meldung (Reihung nach Spielnr.)'!$B$2:$C$97,2)","v":"Hans Perktold u Horst Friedl/Imst"},{"$f":"VLOOKUP(A11,'Meldung (Reihung nach Spielnr.)'!$B$2:$C$97,2)","v":"Thomas Heltschl u Fredl Mungenast/Imst"}]
[{"$f":"Auslosung3!G11","v":7},{"$f":"Auslosung3!H11","v":"Thomas Heltschl u Fredl Mungenast/Imst"},{"$f":"IF(F11+G11>0,IF(H11=\"OK\",IF(G11<F11,G11,100+(G11-F11)),0),0)","v":0},null,null,null,0,{"$f":"IF(OR(F11>=15,G11>=15),\"OK\",\"Fehlende oder falsche EIngabe\")","v":"Fehlende oder falsche EIngabe"}]
[{"$f":"Auslosung3!G12","v":5},{"$f":"Auslosung3!H12","v":"Gerhard Schuler u Meinhard Eiter/Imst"},{"$f":"IF(F13+G13>0,IF(H13=\"OK\",IF(F13<G13,F13,100+(F13-G13)),0),0)","v":0},null,null,{"$f":"VLOOKUP(A12,'Meldung (Reihung nach Spielnr.)'!$B$2:$C$97,2)","v":"Gerhard Schuler u Meinhard Eiter/Imst"},{"$f":"VLOOKUP(A13,'Meldung (Reihung nach Spielnr.)'!$B$2:$C$97,2)","v":"Bernhard Meischberger u Martin Staggl/Kematen"}]
[{"$f":"Auslosung3!G13","v":15},{"$f":"Auslosung3!H13","v":"Bernhard Meischberger u Martin Staggl/Kematen"},{"$f":"IF(F13+G13>0,IF(H13=\"OK\",IF(G13<F13,G13,100+(G13-F13)),0),0)","v":0},null,null,null,0,{"$f":"IF(OR(F13>=15,G13>=15),\"OK\",\"Fehlende oder falsche EIngabe\")","v":"Fehlende oder falsche EIngabe"}]
[{"$f":"Auslosung3!G14","v":20},{"$f":"Auslosung3!H14","v":"Krissmer Reinhard | Fringer Fred"},{"$f":"IF(F15+G15>0,IF(H15=\"OK\",IF(F15<G15,F15,100+(F15-G15)),0),0)","v":0},null,null,{"$f":"VLOOKUP(A14,'Meldung (Reihung nach Spielnr.)'!$B$2:$C$97,2)","v":"Krissmer Reinhard | Fringer Fred"},{"$f":"VLOOKUP(A15,'Meldung (Reihung nach Spielnr.)'!$B$2:$C$97,2)","v":"Peter Auer u Stefan Sarg/Axams"}]
[{"$f":"Auslosung3!G15","v":13},{"$f":"Auslosung3!H15","v":"Peter Auer u Stefan Sarg/Axams"},{"$f":"IF(F15+G15>0,IF(H15=\"OK\",IF(G15<F15,G15,100+(G15-F15)),0),0)","v":0},null,null,null,0,{"$f":"IF(OR(F15>=15,G15>=15),\"OK\",\"Fehlende oder falsche EIngabe\")","v":"Fehlende oder falsche EIngabe"}]
[{"$f":"Auslosung3!G16","v":8},{"$f":"Auslosung3!H16","v":"Herbert Lechleitner u  Stefan Krabichler/Imst"},{"$f":"IF(F17+G17>0,IF(H17=\"OK\",IF(F17<G17,F17,100+(F17-G17)),0),0)","v":0},null,null,{"$f":"VLOOKUP(A16,'Meldung (Reihung nach Spielnr.)'!$B$2:$C$97,2)","v":"Herbert Lechleitner u  Stefan Krabichler/Imst"},{"$f":"VLOOKUP(A17,'Meldung (Reihung nach Spielnr.)'!$B$2:$C$97,2)","v":"Kurt Zebisch | Mr. Bean"}]
[{"$f":"Auslosung3!G17","v":19},{"$f":"Auslosung3!H17","v":"Kurt Zebisch | Mr. Bean"},{"$f":"IF(F17+G17>0,IF(H17=\"OK\",IF(G17<F17,G17,100+(G17-F17)),0),0)","v":0},null,null,null,null,{"$f":"IF(OR(F17>=15,G17>=15),\"OK\",\"Fehlende oder falsche EIngabe\")","v":"Fehlende oder falsche EIngabe"}]
[{"$f":"Auslosung3!G18","v":16},{"$f":"Auslosung3!H18","v":"Hermann Lechner u Andreas Oberacher/Kematen"},{"$f":"IF(F19+G19>0,IF(H19=\"OK\",IF(F19<G19,F19,100+(F19-G19)),0),0)","v":0},null,null,{"$f":"VLOOKUP(A18,'Meldung (Reihung nach Spielnr.)'!$B$2:$C$97,2)","v":"Hermann Lechner u Andreas Oberacher/Kematen"},{"$f":"VLOOKUP(A19,'Meldung (Reihung nach Spielnr.)'!$B$2:$C$97,2)","v":"Annette u Veronika/Telfs"}]
[{"$f":"Auslosung3!G19","v":2},{"$f":"Auslosung3!H19","v":"Annette u Veronika/Telfs"},{"$f":"IF(F19+G19>0,IF(H19=\"OK\",IF(G19<F19,G19,100+(G19-F19)),0),0)","v":0},null,null,null,0,{"$f":"IF(OR(F19>=15,G19>=15),\"OK\",\"Fehlende oder falsche EIngabe\")","v":"Fehlende oder falsche EIngabe"}]
[{"$f":"Auslosung3!G20","v":18},{"$f":"Auslosung3!H20","v":"Josef Eisenbeutl u Herbert Gamper/Imst"},{"$f":"IF(F21+G21>0,IF(H21=\"OK\",IF(F21<G21,F21,100+(F21-G21)),0),0)","v":0},null,null,{"$f":"VLOOKUP(A20,'Meldung (Reihung nach Spielnr.)'!$B$2:$C$97,2)","v":"Josef Eisenbeutl u Herbert Gamper/Imst"},{"$f":"VLOOKUP(A21,'Meldung (Reihung nach Spielnr.)'!$B$2:$C$97,2)","v":"Heini Gruber u Gottfried Geier/Südtirol"}]
[{"$f":"Auslosung3!G21","v":11},{"$f":"Auslosung3!H21","v":"Heini Gruber u Gottfried Geier/Südtirol"},{"$f":"IF(F21+G21>0,IF(H21=\"OK\",IF(G21<F21,G21,100+(G21-F21)),0),0)","v":0},null,null,null,0,{"$f":"IF(OR(F21>=15,G21>=15),\"OK\",\"Fehlende oder falsche EIngabe\")","v":"Fehlende oder falsche EIngabe"}]
[{"$f":"Auslosung3!G22","v":0},{"$f":"Auslosung3!H22","v":{"$error":"#N/A"}},{"$f":"IF(F23+G23>0,IF(H23=\"OK\",IF(F23<G23,F23,100+(F23-G23)),0),0)","v":0},null,null,{"$f":"VLOOKUP(A22,'Meldung (Reihung nach Spielnr.)'!$B$2:$C$97,2)","v":{"$error":"#N/A"}},{"$f":"VLOOKUP(A23,'Meldung (Reihung nach Spielnr.)'!$B$2:$C$97,2)","v":{"$error":"#N/A"}}]
[{"$f":"Auslosung3!G23","v":0},{"$f":"Auslosung3!H23","v":{"$error":"#N/A"}},{"$f":"IF(F23+G23>0,IF(H23=\"OK\",IF(G23<F23,G23,100+(G23-F23)),0),0)","v":0},null,null,null,0,{"$f":"IF(OR(F23>=15,G23>=15),\"OK\",\"Fehlende oder falsche EIngabe\")","v":"Fehlende oder falsche EIngabe"}]
[{"$f":"Auslosung3!G24","v":0},{"$f":"Auslosung3!H24","v":{"$error":"#N/A"}},{"$f":"IF(F25+G25>0,IF(H25=\"OK\",IF(F25<G25,F25,100+(F25-G25)),0),0)","v":0},null,null,{"$f":"VLOOKUP(A24,'Meldung (Reihung nach Spielnr.)'!$B$2:$C$97,2)","v":{"$error":"#N/A"}},{"$f":"VLOOKUP(A25,'Meldung (Reihung nach Spielnr.)'!$B$2:$C$97,2)","v":{"$error":"#N/A"}}]
[{"$f":"Auslosung3!G25","v":0},{"$f":"Auslosung3!H25","v":{"$error":"#N/A"}},{"$f":"IF(F25+G25>0,IF(H25=\"OK\",IF(G25<F25,G25,100+(G25-F25)),0),0)","v":0},null,null,null,0,{"$f":"IF(OR(F25>=15,G25>=15),\"OK\",\"Fehlende oder falsche EIngabe\")","v":"Fehlende oder falsche EIngabe"}]
[{"$f":"Auslosung3!G26","v":0},{"$f":"Auslosung3!H26","v":{"$error":"#N/A"}},{"$f":"IF(F27+G27>0,IF(H27=\"OK\",IF(F27<G27,F27,100+(F27-G27)),0),0)","v":0},null,null,{"$f":"VLOOKUP(A26,'Meldung (Reihung nach Spielnr.)'!$B$2:$C$97,2)","v":{"$error":"#N/A"}},{"$f":"VLOOKUP(A27,'Meldung (Reihung nach Spielnr.)'!$B$2:$C$97,2)","v":{"$error":"#N/A"}}]
[{"$f":"Auslosung3!G27","v":0},{"$f":"Auslosung3!H27","v":{"$error":"#N/A"}},{"$f":"IF(F27+G27>0,IF(H27=\"OK\",IF(G27<F27,G27,100+(G27-F27)),0),0)","v":0},null,null,null,0,{"$f":"IF(OR(F27>=15,G27>=15),\"OK\",\"Fehlende oder falsche EIngabe\")","v":"Fehlende oder falsche EIngabe"}]
[{"$f":"Auslosung3!G28","v":0},{"$f":"Auslosung3!H28","v":{"$error":"#N/A"}},{"$f":"IF(F29+G29>0,IF(H29=\"OK\",IF(F29<G29,F29,100+(F29-G29)),0),0)","v":0},null,null,{"$f":"VLOOKUP(A28,'Meldung (Reihung nach Spielnr.)'!$B$2:$C$97,2)","v":{"$error":"#N/A"}},{"$f":"VLOOKUP(A29,'Meldung (Reihung nach Spielnr.)'!$B$2:$C$97,2)","v":{"$error":"#N/A"}}]
[{"$f":"Auslosung3!G29","v":0},{"$f":"Auslosung3!H29","v":{"$error":"#N/A"}},{"$f":"IF(F29+G29>0,IF(H29=\"OK\",IF(G29<F29,G29,100+(G29-F29)),0),0)","v":0},null,null,null,0,{"$f":"IF(OR(F29>=15,G29>=15),\"OK\",\"Fehlende oder falsche EIngabe\")","v":"Fehlende oder falsche EIngabe"}]
[{"$f":"Auslosung3!G30","v":0},{"$f":"Auslosung3!H30","v":{"$error":"#N/A"}},{"$f":"IF(F31+G31>0,IF(H31=\"OK\",IF(F31<G31,F31,100+(F31-G31)),0),0)","v":0},null,null,{"$f":"VLOOKUP(A30,'Meldung (Reihung nach Spielnr.)'!$B$2:$C$97,2)","v":{"$error":"#N/A"}},{"$f":"VLOOKUP(A31,'Meldung (Reihung nach Spielnr.)'!$B$2:$C$97,2)","v":{"$error":"#N/A"}}]
[{"$f":"Auslosung3!G31","v":0},{"$f":"Auslosung3!H31","v":{"$error":"#N/A"}},{"$f":"IF(F31+G31>0,IF(H31=\"OK\",IF(G31<F31,G31,100+(G31-F31)),0),0)","v":0},null,null,null,0,{"$f":"IF(OR(F31>=15,G31>=15),\"OK\",\"Fehlende oder falsche EIngabe\")","v":"Fehlende oder falsche EIngabe"}]
[{"$f":"Auslosung3!G32","v":0},{"$f":"Auslosung3!H32","v":{"$error":"#N/A"}},{"$f":"IF(F33+G33>0,IF(H33=\"OK\",IF(F33<G33,F33,100+(F33-G33)),0),0)","v":0},null,null,{"$f":"VLOOKUP(A32,'Meldung (Reihung nach Spielnr.)'!$B$2:$C$97,2)","v":{"$error":"#N/A"}},{"$f":"VLOOKUP(A33,'Meldung (Reihung nach Spielnr.)'!$B$2:$C$97,2)","v":{"$error":"#N/A"}}]
[{"$f":"Auslosung3!G33","v":0},{"$f":"Auslosung3!H33","v":{"$error":"#N/A"}},{"$f":"IF(F33+G33>0,IF(H33=\"OK\",IF(G33<F33,G33,100+(G33-F33)),0),0)","v":0},null,null,null,0,{"$f":"IF(OR(F33>=15,G33>=15),\"OK\",\"Fehlende oder falsche EIngabe\")","v":"Fehlende oder falsche EIngabe"}]
[{"$f":"Auslosung3!G34","v":0},{"$f":"Auslosung3!H34","v":{"$error":"#N/A"}},{"$f":"IF(F35+G35>0,IF(H35=\"OK\",IF(F35<G35,F35,100+(F35-G35)),0),0)","v":0},null,null,{"$f":"VLOOKUP(A34,'Meldung (Reihung nach Spielnr.)'!$B$2:$C$97,2)","v":{"$error":"#N/A"}},{"$f":"VLOOKUP(A35,'Meldung (Reihung nach Spielnr.)'!$B$2:$C$97,2)","v":{"$error":"#N/A"}}]
[{"$f":"Auslosung3!G35","v":0},{"$f":"Auslosung3!H35","v":{"$error":"#N/A"}},{"$f":"IF(F35+G35>0,IF(H35=\"OK\",IF(G35<F35,G35,100+(G35-F35)),0),0)","v":0},null,null,null,0,{"$f":"IF(OR(F35>=15,G35>=15),\"OK\",\"Fehlende oder falsche EIngabe\")","v":"Fehlende oder falsche EIngabe"}]
[{"$f":"Auslosung3!G36","v":0},{"$f":"Auslosung3!H36","v":{"$error":"#N/A"}},{"$f":"IF(F37+G37>0,IF(H37=\"OK\",IF(F37<G37,F37,100+(F37-G37)),0),0)","v":0},null,null,{"$f":"VLOOKUP(A36,'Meldung (Reihung nach Spielnr.)'!$B$2:$C$97,2)","v":{"$error":"#N/A"}},{"$f":"VLOOKUP(A37,'Meldung (Reihung nach Spielnr.)'!$B$2:$C$97,2)","v":{"$error":"#N/A"}}]
[{"$f":"Auslosung3!G37","v":0},{"$f":"Auslosung3!H37","v":{"$error":"#N/A"}},{"$f":"IF(F37+G37>0,IF(H37=\"OK\",IF(G37<F37,G37,100+(G37-F37)),0),0)","v":0},null,null,null,0,{"$f":"IF(OR(F37>=15,G37>=15),\"OK\",\"Fehlende oder falsche EIngabe\")","v":"Fehlende oder falsche EIngabe"}]
[{"$f":"Auslosung3!G38","v":0},{"$f":"Auslosung3!H38","v":{"$error":"#N/A"}},{"$f":"IF(F39+G39>0,IF(H39=\"OK\",IF(F39<G39,F39,100+(F39-G39)),0),0)","v":0},null,null,{"$f":"VLOOKUP(A38,'Meldung (Reihung nach Spielnr.)'!$B$2:$C$97,2)","v":{"$error":"#N/A"}},{"$f":"VLOOKUP(A39,'Meldung (Reihung nach Spielnr.)'!$B$2:$C$97,2)","v":{"$error":"#N/A"}}]
[{"$f":"Auslosung3!G39","v":0},{"$f":"Auslosung3!H39","v":{"$error":"#N/A"}},{"$f":"IF(F39+G39>0,IF(H39=\"OK\",IF(G39<F39,G39,100+(G39-F39)),0),0)","v":0},null,null,null,0,{"$f":"IF(OR(F39>=15,G39>=15),\"OK\",\"Fehlende oder falsche EIngabe\")","v":"Fehlende oder falsche EIngabe"}]
[{"$f":"Auslosung3!G40","v":0},{"$f":"Auslosung3!H40","v":{"$error":"#N/A"}},{"$f":"IF(F41+G41>0,IF(H41=\"OK\",IF(F41<G41,F41,100+(F41-G41)),0),0)","v":0},null,null,{"$f":"VLOOKUP(A40,'Meldung (Reihung nach Spielnr.)'!$B$2:$C$97,2)","v":{"$error":"#N/A"}},{"$f":"VLOOKUP(A41,'Meldung (Reihung nach Spielnr.)'!$B$2:$C$97,2)","v":{"$error":"#N/A"}}]
[{"$f":"Auslosung3!G41","v":0},{"$f":"Auslosung3!H41","v":{"$error":"#N/A"}},{"$f":"IF(F41+G41>0,IF(H41=\"OK\",IF(G41<F41,G41,100+(G41-F41)),0),0)","v":0},null,null,null,0,{"$f":"IF(OR(F41>=15,G41>=15),\"OK\",\"Fehlende oder falsche EIngabe\")","v":"Fehlende oder falsche EIngabe"}]
[{"$f":"Auslosung3!G42","v":0},{"$f":"Auslosung3!H42","v":{"$error":"#N/A"}},{"$f":"IF(F43+G43>0,IF(H43=\"OK\",IF(F43<G43,F43,100+(F43-G43)),0),0)","v":0},null,null,{"$f":"VLOOKUP(A42,'Meldung (Reihung nach Spielnr.)'!$B$2:$C$97,2)","v":{"$error":"#N/A"}},{"$f":"VLOOKUP(A43,'Meldung (Reihung nach Spielnr.)'!$B$2:$C$97,2)","v":{"$error":"#N/A"}}]
[{"$f":"Auslosung3!G43","v":0},{"$f":"Auslosung3!H43","v":{"$error":"#N/A"}},{"$f":"IF(F43+G43>0,IF(H43=\"OK\",IF(G43<F43,G43,100+(G43-F43)),0),0)","v":0},null,null,null,0,{"$f":"IF(OR(F43>=15,G43>=15),\"OK\",\"Fehlende oder falsche EIngabe\")","v":"Fehlende oder falsche EIngabe"}]
[{"$f":"Auslosung3!G44","v":0},{"$f":"Auslosung3!H44","v":{"$error":"#N/A"}},{"$f":"IF(F45+G45>0,IF(H45=\"OK\",IF(F45<G45,F45,100+(F45-G45)),0),0)","v":0},null,null,{"$f":"VLOOKUP(A44,'Meldung (Reihung nach Spielnr.)'!$B$2:$C$97,2)","v":{"$error":"#N/A"}},{"$f":"VLOOKUP(A45,'Meldung (Reihung nach Spielnr.)'!$B$2:$C$97,2)","v":{"$error":"#N/A"}}]
[{"$f":"Auslosung3!G45","v":0},{"$f":"Auslosung3!H45","v":{"$error":"#N/A"}},{"$f":"IF(F45+G45>0,IF(H45=\"OK\",IF(G45<F45,G45,100+(G45-F45)),0),0)","v":0},null,null,null,0,{"$f":"IF(OR(F45>=15,G45>=15),\"OK\",\"Fehlende oder falsche EIngabe\")","v":"Fehlende oder falsche EIngabe"}]
[{"$f":"Auslosung3!G46","v":0},{"$f":"Auslosung3!H46","v":{"$error":"#N/A"}},{"$f":"IF(F47+G47>0,IF(H47=\"OK\",IF(F47<G47,F47,100+(F47-G47)),0),0)","v":0},null,null,{"$f":"VLOOKUP(A46,'Meldung (Reihung nach Spielnr.)'!$B$2:$C$97,2)","v":{"$error":"#N/A"}},{"$f":"VLOOKUP(A47,'Meldung (Reihung nach Spielnr.)'!$B$2:$C$97,2)","v":{"$error":"#N/A"}}]
[{"$f":"Auslosung3!G47","v":0},{"$f":"Auslosung3!H47","v":{"$error":"#N/A"}},{"$f":"IF(F47+G47>0,IF(H47=\"OK\",IF(G47<F47,G47,100+(G47-F47)),0),0)","v":0},null,null,null,0,{"$f":"IF(OR(F47>=15,G47>=15),\"OK\",\"Fehlende oder falsche EIngabe\")","v":"Fehlende oder falsche EIngabe"}]
[{"$f":"Auslosung3!G48","v":0},{"$f":"Auslosung3!H48","v":{"$error":"#N/A"}},{"$f":"IF(F49+G49>0,IF(H49=\"OK\",IF(F49<G49,F49,100+(F49-G49)),0),0)","v":0},null,null,{"$f":"VLOOKUP(A48,'Meldung (Reihung nach Spielnr.)'!$B$2:$C$97,2)","v":{"$error":"#N/A"}},{"$f":"VLOOKUP(A49,'Meldung (Reihung nach Spielnr.)'!$B$2:$C$97,2)","v":{"$error":"#N/A"}}]
[{"$f":"Auslosung3!G49","v":0},{"$f":"Auslosung3!H49","v":{"$error":"#N/A"}},{"$f":"IF(F49+G49>0,IF(H49=\"OK\",IF(G49<F49,G49,100+(G49-F49)),0),0)","v":0},null,null,null,0,{"$f":"IF(OR(F49>=15,G49>=15),\"OK\",\"Fehlende oder falsche EIngabe\")","v":"Fehlende oder falsche EIngabe"}]
[{"$f":"Auslosung3!G50","v":0},{"$f":"Auslosung3!H50","v":{"$error":"#N/A"}},{"$f":"IF(F51+G51>0,IF(H51=\"OK\",IF(F51<G51,F51,100+(F51-G51)),0),0)","v":0},null,null,{"$f":"VLOOKUP(A50,'Meldung (Reihung nach Spielnr.)'!$B$2:$C$97,2)","v":{"$error":"#N/A"}},{"$f":"VLOOKUP(A51,'Meldung (Reihung nach Spielnr.)'!$B$2:$C$97,2)","v":{"$error":"#N/A"}}]
[{"$f":"Auslosung3!G51","v":0},{"$f":"Auslosung3!H51","v":{"$error":"#N/A"}},{"$f":"IF(F51+G51>0,IF(H51=\"OK\",IF(G51<F51,G51,100+(G51-F51)),0),0)","v":0},null,null,null,0,{"$f":"IF(OR(F51>=15,G51>=15),\"OK\",\"Fehlende oder falsche EIngabe\")","v":"Fehlende oder falsche EIngabe"}]
[{"$f":"Auslosung3!G52","v":0},{"$f":"Auslosung3!H52","v":{"$error":"#N/A"}},{"$f":"IF(F53+G53>0,IF(H53=\"OK\",IF(F53<G53,F53,100+(F53-G53)),0),0)","v":0},null,null,{"$f":"VLOOKUP(A52,'Meldung (Reihung nach Spielnr.)'!$B$2:$C$97,2)","v":{"$error":"#N/A"}},{"$f":"VLOOKUP(A53,'Meldung (Reihung nach Spielnr.)'!$B$2:$C$97,2)","v":{"$error":"#N/A"}}]
[{"$f":"Auslosung3!G53","v":0},{"$f":"Auslosung3!H53","v":{"$error":"#N/A"}},{"$f":"IF(F53+G53>0,IF(H53=\"OK\",IF(G53<F53,G53,100+(G53-F53)),0),0)","v":0},null,null,null,0,{"$f":"IF(OR(F53>=15,G53>=15),\"OK\",\"Fehlende oder falsche EIngabe\")","v":"Fehlende oder falsche EIngabe"}]
[{"$f":"Auslosung3!G54","v":0},{"$f":"Auslosung3!H54","v":{"$error":"#N/A"}},{"$f":"IF(F55+G55>0,IF(H55=\"OK\",IF(F55<G55,F55,100+(F55-G55)),0),0)","v":0},null,null,{"$f":"VLOOKUP(A54,'Meldung (Reihung nach Spielnr.)'!$B$2:$C$97,2)","v":{"$error":"#N/A"}},{"$f":"VLOOKUP(A55,'Meldung (Reihung nach Spielnr.)'!$B$2:$C$97,2)","v":{"$error":"#N/A"}}]
[{"$f":"Auslosung3!G55","v":0},{"$f":"Auslosung3!H55","v":{"$error":"#N/A"}},{"$f":"IF(F55+G55>0,IF(H55=\"OK\",IF(G55<F55,G55,100+(G55-F55)),0),0)","v":0},null,null,null,0,{"$f":"IF(OR(F55>=15,G55>=15),\"OK\",\"Fehlende oder falsche EIngabe\")","v":"Fehlende oder falsche EIngabe"}]
[{"$f":"Auslosung3!G56","v":0},{"$f":"Auslosung3!H56","v":{"$error":"#N/A"}},{"$f":"IF(F57+G57>0,IF(H57=\"OK\",IF(F57<G57,F57,100+(F57-G57)),0),0)","v":0},null,null,{"$f":"VLOOKUP(A56,'Meldung (Reihung nach Spielnr.)'!$B$2:$C$97,2)","v":{"$error":"#N/A"}},{"$f":"VLOOKUP(A57,'Meldung (Reihung nach Spielnr.)'!$B$2:$C$97,2)","v":{"$error":"#N/A"}}]
[{"$f":"Auslosung3!G57","v":0},{"$f":"Auslosung3!H57","v":{"$error":"#N/A"}},{"$f":"IF(F57+G57>0,IF(H57=\"OK\",IF(G57<F57,G57,100+(G57-F57)),0),0)","v":0},null,null,null,0,{"$f":"IF(OR(F57>=15,G57>=15),\"OK\",\"Fehlende oder falsche EIngabe\")","v":"Fehlende oder falsche EIngabe"}]
[{"$f":"Auslosung3!G58","v":0},{"$f":"Auslosung3!H58","v":{"$error":"#N/A"}},{"$f":"IF(F59+G59>0,IF(H59=\"OK\",IF(F59<G59,F59,100+(F59-G59)),0),0)","v":0},null,null,{"$f":"VLOOKUP(A58,'Meldung (Reihung nach Spielnr.)'!$B$2:$C$97,2)","v":{"$error":"#N/A"}},{"$f":"VLOOKUP(A59,'Meldung (Reihung nach Spielnr.)'!$B$2:$C$97,2)","v":{"$error":"#N/A"}}]
[{"$f":"Auslosung3!G59","v":0},{"$f":"Auslosung3!H59","v":{"$error":"#N/A"}},{"$f":"IF(F59+G59>0,IF(H59=\"OK\",IF(G59<F59,G59,100+(G59-F59)),0),0)","v":0},null,null,null,0,{"$f":"IF(OR(F59>=15,G59>=15),\"OK\",\"Fehlende oder falsche EIngabe\")","v":"Fehlende oder falsche EIngabe"}]
[{"$f":"Auslosung3!G60","v":0},{"$f":"Auslosung3!H60","v":{"$error":"#N/A"}},{"$f":"IF(F61+G61>0,IF(H61=\"OK\",IF(F61<G61,F61,100+(F61-G61)),0),0)","v":0},null,null,{"$f":"VLOOKUP(A60,'Meldung (Reihung nach Spielnr.)'!$B$2:$C$97,2)","v":{"$error":"#N/A"}},{"$f":"VLOOKUP(A61,'Meldung (Reihung nach Spielnr.)'!$B$2:$C$97,2)","v":{"$error":"#N/A"}}]
[{"$f":"Auslosung3!G61","v":0},{"$f":"Auslosung3!H61","v":{"$error":"#N/A"}},{"$f":"IF(F61+G61>0,IF(H61=\"OK\",IF(G61<F61,G61,100+(G61-F61)),0),0)","v":0},null,null,null,0,{"$f":"IF(OR(F61>=15,G61>=15),\"OK\",\"Fehlende oder falsche EIngabe\")","v":"Fehlende oder falsche EIngabe"}]
[{"$f":"Auslosung3!G62","v":0},{"$f":"Auslosung3!H62","v":{"$error":"#N/A"}},{"$f":"IF(F63+G63>0,IF(H63=\"OK\",IF(F63<G63,F63,100+(F63-G63)),0),0)","v":0},null,null,{"$f":"VLOOKUP(A62,'Meldung (Reihung nach Spielnr.)'!$B$2:$C$97,2)","v":{"$error":"#N/A"}},{"$f":"VLOOKUP(A63,'Meldung (Reihung nach Spielnr.)'!$B$2:$C$97,2)","v":{"$error":"#N/A"}}]
[{"$f":"Auslosung3!G63","v":0},{"$f":"Auslosung3!H63","v":{"$error":"#N/A"}},{"$f":"IF(F63+G63>0,IF(H63=\"OK\",IF(G63<F63,G63,100+(G63-F63)),0),0)","v":0},null,null,null,0,{"$f":"IF(OR(F63>=15,G63>=15),\"OK\",\"Fehlende oder falsche EIngabe\")","v":"Fehlende oder falsche EIngabe"}]
[{"$f":"Auslosung3!G64","v":0},{"$f":"Auslosung3!H64","v":{"$error":"#N/A"}},{"$f":"IF(F65+G65>0,IF(H65=\"OK\",IF(F65<G65,F65,100+(F65-G65)),0),0)","v":0},null,null,{"$f":"VLOOKUP(A64,'Meldung (Reihung nach Spielnr.)'!$B$2:$C$97,2)","v":{"$error":"#N/A"}},{"$f":"VLOOKUP(A65,'Meldung (Reihung nach Spielnr.)'!$B$2:$C$97,2)","v":{"$error":"#N/A"}}]
[{"$f":"Auslosung3!G65","v":0},{"$f":"Auslosung3!H65","v":{"$error":"#N/A"}},{"$f":"IF(F65+G65>0,IF(H65=\"OK\",IF(G65<F65,G65,100+(G65-F65)),0),0)","v":0},null,null,null,0,{"$f":"IF(OR(F65>=15,G65>=15),\"OK\",\"Fehlende oder falsche EIngabe\")","v":"Fehlende oder falsche EIngabe"}]
[{"$f":"Auslosung3!G66","v":0},{"$f":"Auslosung3!H66","v":{"$error":"#N/A"}},{"$f":"IF(F67+G67>0,IF(H67=\"OK\",IF(F67<G67,F67,100+(F67-G67)),0),0)","v":0},null,null,{"$f":"VLOOKUP(A66,'Meldung (Reihung nach Spielnr.)'!$B$2:$C$97,2)","v":{"$error":"#N/A"}},{"$f":"VLOOKUP(A67,'Meldung (Reihung nach Spielnr.)'!$B$2:$C$97,2)","v":{"$error":"#N/A"}}]
[{"$f":"Auslosung3!G67","v":0},{"$f":"Auslosung3!H67","v":{"$error":"#N/A"}},{"$f":"IF(F67+G67>0,IF(H67=\"OK\",IF(G67<F67,G67,100+(G67-F67)),0),0)","v":0},null,null,null,0,{"$f":"IF(OR(F67>=15,G67>=15),\"OK\",\"Fehlende oder falsche EIngabe\")","v":"Fehlende oder falsche EIngabe"}]
[{"$f":"Auslosung3!G68","v":0},{"$f":"Auslosung3!H68","v":{"$error":"#N/A"}},{"$f":"IF(F69+G69>0,IF(H69=\"OK\",IF(F69<G69,F69,100+(F69-G69)),0),0)","v":0},null,null,{"$f":"VLOOKUP(A68,'Meldung (Reihung nach Spielnr.)'!$B$2:$C$97,2)","v":{"$error":"#N/A"}},{"$f":"VLOOKUP(A69,'Meldung (Reihung nach Spielnr.)'!$B$2:$C$97,2)","v":{"$error":"#N/A"}}]
[{"$f":"Auslosung3!G69","v":0},{"$f":"Auslosung3!H69","v":{"$error":"#N/A"}},{"$f":"IF(F69+G69>0,IF(H69=\"OK\",IF(G69<F69,G69,100+(G69-F69)),0),0)","v":0},null,null,null,0,{"$f":"IF(OR(F69>=15,G69>=15),\"OK\",\"Fehlende oder falsche EIngabe\")","v":"Fehlende oder falsche EIngabe"}]
[{"$f":"Auslosung3!G70","v":0},{"$f":"Auslosung3!H70","v":{"$error":"#N/A"}},{"$f":"IF(F71+G71>0,IF(H71=\"OK\",IF(F71<G71,F71,100+(F71-G71)),0),0)","v":0},null,null,{"$f":"VLOOKUP(A70,'Meldung (Reihung nach Spielnr.)'!$B$2:$C$97,2)","v":{"$error":"#N/A"}},{"$f":"VLOOKUP(A71,'Meldung (Reihung nach Spielnr.)'!$B$2:$C$97,2)","v":{"$error":"#N/A"}}]
[{"$f":"Auslosung3!G71","v":0},{"$f":"Auslosung3!H71","v":{"$error":"#N/A"}},{"$f":"IF(F71+G71>0,IF(H71=\"OK\",IF(G71<F71,G71,100+(G71-F71)),0),0)","v":0},null,null,null,0,{"$f":"IF(OR(F71>=15,G71>=15),\"OK\",\"Fehlende oder falsche EIngabe\")","v":"Fehlende oder falsche EIngabe"}]
[{"$f":"Auslosung3!G72","v":0},{"$f":"Auslosung3!H72","v":{"$error":"#N/A"}},{"$f":"IF(F73+G73>0,IF(H73=\"OK\",IF(F73<G73,F73,100+(F73-G73)),0),0)","v":0},null,null,{"$f":"VLOOKUP(A72,'Meldung (Reihung nach Spielnr.)'!$B$2:$C$97,2)","v":{"$error":"#N/A"}},{"$f":"VLOOKUP(A73,'Meldung (Reihung nach Spielnr.)'!$B$2:$C$97,2)","v":{"$error":"#N/A"}}]
[{"$f":"Auslosung3!G73","v":0},{"$f":"Auslosung3!H73","v":{"$error":"#N/A"}},{"$f":"IF(F73+G73>0,IF(H73=\"OK\",IF(G73<F73,G73,100+(G73-F73)),0),0)","v":0},null,null,null,0,{"$f":"IF(OR(F73>=15,G73>=15),\"OK\",\"Fehlende oder falsche EIngabe\")","v":"Fehlende oder falsche EIngabe"}]
[{"$f":"Auslosung3!G74","v":0},{"$f":"Auslosung3!H74","v":{"$error":"#N/A"}},{"$f":"IF(F75+G75>0,IF(H75=\"OK\",IF(F75<G75,F75,100+(F75-G75)),0),0)","v":0},null,null,{"$f":"VLOOKUP(A74,'Meldung (Reihung nach Spielnr.)'!$B$2:$C$97,2)","v":{"$error":"#N/A"}},{"$f":"VLOOKUP(A75,'Meldung (Reihung nach Spielnr.)'!$B$2:$C$97,2)","v":{"$error":"#N/A"}}]
[{"$f":"Auslosung3!G75","v":0},{"$f":"Auslosung3!H75","v":{"$error":"#N/A"}},{"$f":"IF(F75+G75>0,IF(H75=\"OK\",IF(G75<F75,G75,100+(G75-F75)),0),0)","v":0},null,null,null,0,{"$f":"IF(OR(F75>=15,G75>=15),\"OK\",\"Fehlende oder falsche EIngabe\")","v":"Fehlende oder falsche EIngabe"}]
[{"$f":"Auslosung3!G76","v":0},{"$f":"Auslosung3!H76","v":{"$error":"#N/A"}},{"$f":"IF(F77+G77>0,IF(H77=\"OK\",IF(F77<G77,F77,100+(F77-G77)),0),0)","v":0},null,null,{"$f":"VLOOKUP(A76,'Meldung (Reihung nach Spielnr.)'!$B$2:$C$97,2)","v":{"$error":"#N/A"}},{"$f":"VLOOKUP(A77,'Meldung (Reihung nach Spielnr.)'!$B$2:$C$97,2)","v":{"$error":"#N/A"}}]
[{"$f":"Auslosung3!G77","v":0},{"$f":"Auslosung3!H77","v":{"$error":"#N/A"}},{"$f":"IF(F77+G77>0,IF(H77=\"OK\",IF(G77<F77,G77,100+(G77-F77)),0),0)","v":0},null,null,null,0,{"$f":"IF(OR(F77>=15,G77>=15),\"OK\",\"Fehlende oder falsche EIngabe\")","v":"Fehlende oder falsche EIngabe"}]
[{"$f":"Auslosung3!G78","v":0},{"$f":"Auslosung3!H78","v":{"$error":"#N/A"}},{"$f":"IF(F79+G79>0,IF(H79=\"OK\",IF(F79<G79,F79,100+(F79-G79)),0),0)","v":0},null,null,{"$f":"VLOOKUP(A78,'Meldung (Reihung nach Spielnr.)'!$B$2:$C$97,2)","v":{"$error":"#N/A"}},{"$f":"VLOOKUP(A79,'Meldung (Reihung nach Spielnr.)'!$B$2:$C$97,2)","v":{"$error":"#N/A"}}]
[{"$f":"Auslosung3!G79","v":0},{"$f":"Auslosung3!H79","v":{"$error":"#N/A"}},{"$f":"IF(F79+G79>0,IF(H79=\"OK\",IF(G79<F79,G79,100+(G79-F79)),0),0)","v":0},null,null,null,0,{"$f":"IF(OR(F79>=15,G79>=15),\"OK\",\"Fehlende oder falsche EIngabe\")","v":"Fehlende oder falsche EIngabe"}]
[{"$f":"Auslosung3!G80","v":0},{"$f":"Auslosung3!H80","v":{"$error":"#N/A"}},{"$f":"IF(F81+G81>0,IF(H81=\"OK\",IF(F81<G81,F81,100+(F81-G81)),0),0)","v":0},null,null,{"$f":"VLOOKUP(A80,'Meldung (Reihung nach Spielnr.)'!$B$2:$C$97,2)","v":{"$error":"#N/A"}},{"$f":"VLOOKUP(A81,'Meldung (Reihung nach Spielnr.)'!$B$2:$C$97,2)","v":{"$error":"#N/A"}}]
[{"$f":"Auslosung3!G81","v":0},{"$f":"Auslosung3!H81","v":{"$error":"#N/A"}},{"$f":"IF(F81+G81>0,IF(H81=\"OK\",IF(G81<F81,G81,100+(G81-F81)),0),0)","v":0},null,null,null,0,{"$f":"IF(OR(F81>=15,G81>=15),\"OK\",\"Fehlende oder falsche EIngabe\")","v":"Fehlende oder falsche EIngabe"}]
[{"$f":"Auslosung3!G82","v":0},{"$f":"Auslosung3!H82","v":{"$error":"#N/A"}},{"$f":"IF(F83+G83>0,IF(H83=\"OK\",IF(F83<G83,F83,100+(F83-G83)),0),0)","v":0},null,null,{"$f":"VLOOKUP(A82,'Meldung (Reihung nach Spielnr.)'!$B$2:$C$97,2)","v":{"$error":"#N/A"}},{"$f":"VLOOKUP(A83,'Meldung (Reihung nach Spielnr.)'!$B$2:$C$97,2)","v":{"$error":"#N/A"}}]
[{"$f":"Auslosung3!G83","v":0},{"$f":"Auslosung3!H83","v":{"$error":"#N/A"}},{"$f":"IF(F83+G83>0,IF(H83=\"OK\",IF(G83<F83,G83,100+(G83-F83)),0),0)","v":0},null,null,null,0,{"$f":"IF(OR(F83>=15,G83>=15),\"OK\",\"Fehlende oder falsche EIngabe\")","v":"Fehlende oder falsche EIngabe"}]
[{"$f":"Auslosung3!G84","v":0},{"$f":"Auslosung3!H84","v":{"$error":"#N/A"}},{"$f":"IF(F85+G85>0,IF(H85=\"OK\",IF(F85<G85,F85,100+(F85-G85)),0),0)","v":0},null,null,{"$f":"VLOOKUP(A84,'Meldung (Reihung nach Spielnr.)'!$B$2:$C$97,2)","v":{"$error":"#N/A"}},{"$f":"VLOOKUP(A85,'Meldung (Reihung nach Spielnr.)'!$B$2:$C$97,2)","v":{"$error":"#N/A"}}]
[{"$f":"Auslosung3!G85","v":0},{"$f":"Auslosung3!H85","v":{"$error":"#N/A"}},{"$f":"IF(F85+G85>0,IF(H85=\"OK\",IF(G85<F85,G85,100+(G85-F85)),0),0)","v":0},null,null,null,0,{"$f":"IF(OR(F85>=15,G85>=15),\"OK\",\"Fehlende oder falsche EIngabe\")","v":"Fehlende oder falsche EIngabe"}]
[{"$f":"Auslosung3!G86","v":0},{"$f":"Auslosung3!H86","v":{"$error":"#N/A"}},{"$f":"IF(F87+G87>0,IF(H87=\"OK\",IF(F87<G87,F87,100+(F87-G87)),0),0)","v":0},null,null,{"$f":"VLOOKUP(A86,'Meldung (Reihung nach Spielnr.)'!$B$2:$C$97,2)","v":{"$error":"#N/A"}},{"$f":"VLOOKUP(A87,'Meldung (Reihung nach Spielnr.)'!$B$2:$C$97,2)","v":{"$error":"#N/A"}}]
[{"$f":"Auslosung3!G87","v":0},{"$f":"Auslosung3!H87","v":{"$error":"#N/A"}},{"$f":"IF(F87+G87>0,IF(H87=\"OK\",IF(G87<F87,G87,100+(G87-F87)),0),0)","v":0},null,null,null,0,{"$f":"IF(OR(F87>=15,G87>=15),\"OK\",\"Fehlende oder falsche EIngabe\")","v":"Fehlende oder falsche EIngabe"}]
[{"$f":"Auslosung3!G88","v":0},{"$f":"Auslosung3!H88","v":{"$error":"#N/A"}},{"$f":"IF(F89+G89>0,IF(H89=\"OK\",IF(F89<G89,F89,100+(F89-G89)),0),0)","v":0},null,null,{"$f":"VLOOKUP(A88,'Meldung (Reihung nach Spielnr.)'!$B$2:$C$97,2)","v":{"$error":"#N/A"}},{"$f":"VLOOKUP(A89,'Meldung (Reihung nach Spielnr.)'!$B$2:$C$97,2)","v":{"$error":"#N/A"}}]
[{"$f":"Auslosung3!G89","v":0},{"$f":"Auslosung3!H89","v":{"$error":"#N/A"}},{"$f":"IF(F89+G89>0,IF(H89=\"OK\",IF(G89<F89,G89,100+(G89-F89)),0),0)","v":0},null,null,null,0,{"$f":"IF(OR(F89>=15,G89>=15),\"OK\",\"Fehlende oder falsche EIngabe\")","v":"Fehlende oder falsche EIngabe"}]
[{"$f":"Auslosung3!G90","v":0},{"$f":"Auslosung3!H90","v":{"$error":"#N/A"}},{"$f":"IF(F91+G91>0,IF(H91=\"OK\",IF(F91<G91,F91,100+(F91-G91)),0),0)","v":0},null,null,{"$f":"VLOOKUP(A90,'Meldung (Reihung nach Spielnr.)'!$B$2:$C$97,2)","v":{"$error":"#N/A"}},{"$f":"VLOOKUP(A91,'Meldung (Reihung nach Spielnr.)'!$B$2:$C$97,2)","v":{"$error":"#N/A"}}]
[{"$f":"Auslosung3!G91","v":0},{"$f":"Auslosung3!H91","v":{"$error":"#N/A"}},{"$f":"IF(F91+G91>0,IF(H91=\"OK\",IF(G91<F91,G91,100+(G91-F91)),0),0)","v":0},null,null,null,0,{"$f":"IF(OR(F91>=15,G91>=15),\"OK\",\"Fehlende oder falsche EIngabe\")","v":"Fehlende oder falsche EIngabe"}]
[{"$f":"Auslosung3!G92","v":0},{"$f":"Auslosung3!H92","v":{"$error":"#N/A"}},{"$f":"IF(F93+G93>0,IF(H93=\"OK\",IF(F93<G93,F93,100+(F93-G93)),0),0)","v":0},null,null,{"$f":"VLOOKUP(A92,'Meldung (Reihung nach Spielnr.)'!$B$2:$C$97,2)","v":{"$error":"#N/A"}},{"$f":"VLOOKUP(A93,'Meldung (Reihung nach Spielnr.)'!$B$2:$C$97,2)","v":{"$error":"#N/A"}}]
[{"$f":"Auslosung3!G93","v":0},{"$f":"Auslosung3!H93","v":{"$error":"#N/A"}},{"$f":"IF(F93+G93>0,IF(H93=\"OK\",IF(G93<F93,G93,100+(G93-F93)),0),0)","v":0},null,null,null,0,{"$f":"IF(OR(F93>=15,G93>=15),\"OK\",\"Fehlende oder falsche EIngabe\")","v":"Fehlende oder falsche EIngabe"}]
[{"$f":"Auslosung3!G94","v":0},{"$f":"Auslosung3!H94","v":{"$error":"#N/A"}},{"$f":"IF(F95+G95>0,IF(H95=\"OK\",IF(F95<G95,F95,100+(F95-G95)),0),0)","v":0},null,null,{"$f":"VLOOKUP(A94,'Meldung (Reihung nach Spielnr.)'!$B$2:$C$97,2)","v":{"$error":"#N/A"}},{"$f":"VLOOKUP(A95,'Meldung (Reihung nach Spielnr.)'!$B$2:$C$97,2)","v":{"$error":"#N/A"}}]
[{"$f":"Auslosung3!G95","v":0},{"$f":"Auslosung3!H95","v":{"$error":"#N/A"}},{"$f":"IF(F95+G95>0,IF(H95=\"OK\",IF(G95<F95,G95,100+(G95-F95)),0),0)","v":0},null,null,null,0,{"$f":"IF(OR(F95>=15,G95>=15),\"OK\",\"Fehlende oder falsche EIngabe\")","v":"Fehlende oder falsche EIngabe"}]
[{"$f":"Auslosung3!G96","v":0},{"$f":"Auslosung3!H96","v":{"$error":"#N/A"}},{"$f":"IF(F97+G97>0,IF(H97=\"OK\",IF(F97<G97,F97,100+(F97-G97)),0),0)","v":0},null,null,{"$f":"VLOOKUP(A96,'Meldung (Reihung nach Spielnr.)'!$B$2:$C$97,2)","v":{"$error":"#N/A"}},{"$f":"VLOOKUP(A97,'Meldung (Reihung nach Spielnr.)'!$B$2:$C$97,2)","v":{"$error":"#N/A"}}]
[{"$f":"Auslosung3!G97","v":0},{"$f":"Auslosung3!H97","v":{"$error":"#N/A"}},{"$f":"IF(F97+G97>0,IF(H97=\"OK\",IF(G97<F97,G97,100+(G97-F97)),0),0)","v":0},null,null,null,0,{"$f":"IF(OR(F97>=15,G97>=15),\"OK\",\"Fehlende oder falsche EIngabe\")","v":"Fehlende oder falsche EIngabe"}]

{"sheet":"Auslosung4","index":8,"n_rows":97,"n_cols":8,"rows_kept":97,"cut":false,"hidden":false,"merged":[]}
[17,"Geben Sie in die grüne Zelle, die Anzahl der Mitspieler ein",null,null,"Zahl","TISCH","Spieler Nr.","Name"]
[1,{"$f":"Auslosung1!B2","v":20},null,null,1,1,{"$f":"A1","v":17},{"$f":"VLOOKUP(A1,'Meldung (Reihung nach Spielnr.)'!$B$2:$C$97,2)","v":"Karin Logar u Rudolf Häusler/Kematen"}]
[11,{"$f":"'Meldung (Reihung nach Spielnr.)'!M1","v":20},null,null,2,1,{"$f":"A2","v":1},{"$f":"VLOOKUP(A2,'Meldung (Reihung nach Spielnr.)'!$B$2:$C$97,2)","v":"Edi u Gerald/Telfs"}]
[3,null,null,null,3,2,11,{"$f":"VLOOKUP(A3,'Meldung (Reihung nach Spielnr.)'!$B$2:$C$97,2)","v":"Heini Gruber u Gottfried Geier/Südtirol"}]
[6,null,null,null,4,2,3,{"$f":"VLOOKUP(A4,'Meldung (Reihung nach Spielnr.)'!$B$2:$C$97,2)","v":"Hubert Auer u Daniela Nöbauer/Telfs"}]
[16,null,null,null,5,3,6,{"$f":"VLOOKUP(A5,'Meldung (Reihung nach Spielnr.)'!$B$2:$C$97,2)","v":"Hans Perktold u Horst Friedl/Imst"}]
[18,null,null,null,6,3,16,{"$f":"VLOOKUP(A6,'Meldung (Reihung nach Spielnr.)'!$B$2:$C$97,2)","v":"Hermann Lechner u Andreas Oberacher/Kematen"}]
[7,null,null,null,7,4,18,{"$f":"VLOOKUP(A7,'Meldung (Reihung nach Spielnr.)'!$B$2:$C$97,2)","v":"Josef Eisenbeutl u Herbert Gamper/Imst"}]
[4,null,null,null,8,4,7,{"$f":"VLOOKUP(A8,'Meldung (Reihung nach Spielnr.)'!$B$2:$C$97,2)","v":"Thomas Heltschl u Fredl Mungenast/Imst"}]
[8,null,null,null,9,5,4,{"$f":"VLOOKUP(A9,'Meldung (Reihung nach Spielnr.)'!$B$2:$C$97,2)","v":"Andi Krajic u Peter Doblander/Tarrenz"}]
[20,null,null,null,10,5,8,{"$f":"VLOOKUP(A10,'Meldung (Reihung nach Spielnr.)'!$B$2:$C$97,2)","v":"Herbert Lechleitner u  Stefan Krabichler/Imst"}]
[2,null,null,null,11,6,20,{"$f":"VLOOKUP(A11,'Meldung (Reihung nach Spielnr.)'!$B$2:$C$97,2)","v":"Krissmer Reinhard | Fringer Fred"}]
[14,null,null,null,12,6,2,{"$f":"VLOOKUP(A12,'Meldung (Reihung nach Spielnr.)'!$B$2:$C$97,2)","v":"Annette u Veronika/Telfs"}]
[12,null,null,null,13,7,14,{"$f":"VLOOKUP(A13,'Meldung (Reihung nach Spielnr.)'!$B$2:$C$97,2)","v":"Hansjörg Hell u Franz Braunegger/Axams"}]
[15,null,null,null,14,7,12,{"$f":"VLOOKUP(A14,'Meldung (Reihung nach Spielnr.)'!$B$2:$C$97,2)","v":"Heinrich Ebner u Erich Peer/Südtirol"}]
[5,null,null,null,15,8,15,{"$f":"VLOOKUP(A15,'Meldung (Reihung nach Spielnr.)'!$B$2:$C$97,2)","v":"Bernhard Meischberger u Martin Staggl/Kematen"}]
[10,null,null,null,16,8,5,{"$f":"VLOOKUP(A16,'Meldung (Reihung nach Spielnr.)'!$B$2:$C$97,2)","v":"Gerhard Schuler u Meinhard Eiter/Imst"}]
[19,null,null,null,17,9,10,{"$f":"VLOOKUP(A17,'Meldung (Reihung nach Spielnr.)'!$B$2:$C$97,2)","v":"Franz Pellegrini u Hans Matha/Südtirol"}]
[9,null,null,null,18,9,19,{"$f":"VLOOKUP(A18,'Meldung (Reihung nach Spielnr.)'!$B$2:$C$97,2)","v":"Kurt Zebisch | Mr. Bean"}]
[13,null,null,null,19,10,9,{"$f":"VLOOKUP(A19,'Meldung (Reihung nach Spielnr.)'!$B$2:$C$97,2)","v":"Rudi Kastner u Peter Tschenett/Imst"}]
[null,null,null,null,20,10,13,{"$f":"VLOOKUP(A20,'Meldung (Reihung nach Spielnr.)'!$B$2:$C$97,2)","v":"Peter Auer u Stefan Sarg/Axams"}]
[null,null,null,null,21,11,0,{"$f":"VLOOKUP(A21,'Meldung (Reihung nach Spielnr.)'!$B$2:$C$97,2)","v":{"$error":"#N/A"}}]
[null,null,null,null,22,11,0,{"$f":"VLOOKUP(A22,'Meldung (Reihung nach Spielnr.)'!$B$2:$C$97,2)","v":{"$error":"#N/A"}}]
[null,null,null,null,23,12,0,{"$f":"VLOOKUP(A23,'Meldung (Reihung nach Spielnr.)'!$B$2:$C$97,2)","v":{"$error":"#N/A"}}]
[null,null,null,null,24,12,0,{"$f":"VLOOKUP(A24,'Meldung (Reihung nach Spielnr.)'!$B$2:$C$97,2)","v":{"$error":"#N/A"}}]
[null,null,null,null,25,13,0,{"$f":"VLOOKUP(A25,'Meldung (Reihung nach Spielnr.)'!$B$2:$C$97,2)","v":{"$error":"#N/A"}}]
[null,null,null,null,26,13,0,{"$f":"VLOOKUP(A26,'Meldung (Reihung nach Spielnr.)'!$B$2:$C$97,2)","v":{"$error":"#N/A"}}]
[null,null,null,null,27,14,0,{"$f":"VLOOKUP(A27,'Meldung (Reihung nach Spielnr.)'!$B$2:$C$97,2)","v":{"$error":"#N/A"}}]
[null,null,null,null,28,14,0,{"$f":"VLOOKUP(A28,'Meldung (Reihung nach Spielnr.)'!$B$2:$C$97,2)","v":{"$error":"#N/A"}}]
[null,null,null,null,29,15,0,{"$f":"VLOOKUP(A29,'Meldung (Reihung nach Spielnr.)'!$B$2:$C$97,2)","v":{"$error":"#N/A"}}]
[null,null,null,null,30,15,0,{"$f":"VLOOKUP(A30,'Meldung (Reihung nach Spielnr.)'!$B$2:$C$97,2)","v":{"$error":"#N/A"}}]
[null,null,null,null,31,16,0,{"$f":"VLOOKUP(A31,'Meldung (Reihung nach Spielnr.)'!$B$2:$C$97,2)","v":{"$error":"#N/A"}}]
[null,null,null,null,32,16,0,{"$f":"VLOOKUP(A32,'Meldung (Reihung nach Spielnr.)'!$B$2:$C$97,2)","v":{"$error":"#N/A"}}]
[null,null,null,null,33,17,0,{"$f":"VLOOKUP(A33,'Meldung (Reihung nach Spielnr.)'!$B$2:$C$97,2)","v":{"$error":"#N/A"}}]
[null,null,null,null,34,17,0,{"$f":"VLOOKUP(A34,'Meldung (Reihung nach Spielnr.)'!$B$2:$C$97,2)","v":{"$error":"#N/A"}}]
[null,null,null,null,35,18,0,{"$f":"VLOOKUP(A35,'Meldung (Reihung nach Spielnr.)'!$B$2:$C$97,2)","v":{"$error":"#N/A"}}]
[null,null,null,null,36,18,0,{"$f":"VLOOKUP(A36,'Meldung (Reihung nach Spielnr.)'!$B$2:$C$97,2)","v":{"$error":"#N/A"}}]
[null,null,null,null,37,19,0,{"$f":"VLOOKUP(A37,'Meldung (Reihung nach Spielnr.)'!$B$2:$C$97,2)","v":{"$error":"#N/A"}}]
[null,null,null,null,38,19,0,{"$f":"VLOOKUP(A38,'Meldung (Reihung nach Spielnr.)'!$B$2:$C$97,2)","v":{"$error":"#N/A"}}]
[null,null,null,null,39,20,0,{"$f":"VLOOKUP(A39,'Meldung (Reihung nach Spielnr.)'!$B$2:$C$97,2)","v":{"$error":"#N/A"}}]
[null,null,null,null,40,20,0,{"$f":"VLOOKUP(A40,'Meldung (Reihung nach Spielnr.)'!$B$2:$C$97,2)","v":{"$error":"#N/A"}}]
[null,null,null,null,41,21,0,{"$f":"VLOOKUP(A41,'Meldung (Reihung nach Spielnr.)'!$B$2:$C$97,2)","v":{"$error":"#N/A"}}]
[null,null,null,null,42,21,0,{"$f":"VLOOKUP(A42,'Meldung (Reihung nach Spielnr.)'!$B$2:$C$97,2)","v":{"$error":"#N/A"}}]
[null,null,null,null,43,22,0,{"$f":"VLOOKUP(A43,'Meldung (Reihung nach Spielnr.)'!$B$2:$C$97,2)","v":{"$error":"#N/A"}}]
[null,null,null,null,44,22,0,{"$f":"VLOOKUP(A44,'Meldung (Reihung nach Spielnr.)'!$B$2:$C$97,2)","v":{"$error":"#N/A"}}]
[null,null,null,null,45,23,0,{"$f":"VLOOKUP(A45,'Meldung (Reihung nach Spielnr.)'!$B$2:$C$97,2)","v":{"$error":"#N/A"}}]
[null,null,null,null,46,23,0,{"$f":"VLOOKUP(A46,'Meldung (Reihung nach Spielnr.)'!$B$2:$C$97,2)","v":{"$error":"#N/A"}}]
[null,null,null,null,47,24,0,{"$f":"VLOOKUP(A47,'Meldung (Reihung nach Spielnr.)'!$B$2:$C$97,2)","v":{"$error":"#N/A"}}]
[null,null,null,null,48,24,0,{"$f":"VLOOKUP(A48,'Meldung (Reihung nach Spielnr.)'!$B$2:$C$97,2)","v":{"$error":"#N/A"}}]
[null,null,null,null,49,25,0,{"$f":"VLOOKUP(A49,'Meldung (Reihung nach Spielnr.)'!$B$2:$C$97,2)","v":{"$error":"#N/A"}}]
[null,null,null,null,50,25,0,{"$f":"VLOOKUP(A50,'Meldung (Reihung nach Spielnr.)'!$B$2:$C$97,2)","v":{"$error":"#N/A"}}]
[null,null,null,null,51,26,0,{"$f":"VLOOKUP(A51,'Meldung (Reihung nach Spielnr.)'!$B$2:$C$97,2)","v":{"$error":"#N/A"}}]
[null,null,null,null,52,26,0,{"$f":"VLOOKUP(A52,'Meldung (Reihung nach Spielnr.)'!$B$2:$C$97,2)","v":{"$error":"#N/A"}}]
[null,null,null,null,53,27,0,{"$f":"VLOOKUP(A53,'Meldung (Reihung nach Spielnr.)'!$B$2:$C$97,2)","v":{"$error":"#N/A"}}]
[null,null,null,null,54,27,0,{"$f":"VLOOKUP(A54,'Meldung (Reihung nach Spielnr.)'!$B$2:$C$97,2)","v":{"$error":"#N/A"}}]
[null,null,null,null,55,28,0,{"$f":"VLOOKUP(A55,'Meldung (Reihung nach Spielnr.)'!$B$2:$C$97,2)","v":{"$error":"#N/A"}}]
[null,null,null,null,56,28,0,{"$f":"VLOOKUP(A56,'Meldung (Reihung nach Spielnr.)'!$B$2:$C$97,2)","v":{"$error":"#N/A"}}]
[null,null,null,null,57,29,0,{"$f":"VLOOKUP(A57,'Meldung (Reihung nach Spielnr.)'!$B$2:$C$97,2)","v":{"$error":"#N/A"}}]
[null,null,null,null,58,29,0,{"$f":"VLOOKUP(A58,'Meldung (Reihung nach Spielnr.)'!$B$2:$C$97,2)","v":{"$error":"#N/A"}}]
[null,null,null,null,59,30,0,{"$f":"VLOOKUP(A59,'Meldung (Reihung nach Spielnr.)'!$B$2:$C$97,2)","v":{"$error":"#N/A"}}]
[null,null,null,null,60,30,0,{"$f":"VLOOKUP(A60,'Meldung (Reihung nach Spielnr.)'!$B$2:$C$97,2)","v":{"$error":"#N/A"}}]
[null,null,null,null,61,31,0,{"$f":"VLOOKUP(A61,'Meldung (Reihung nach Spielnr.)'!$B$2:$C$97,2)","v":{"$error":"#N/A"}}]
[null,null,null,null,62,31,0,{"$f":"VLOOKUP(A62,'Meldung (Reihung nach Spielnr.)'!$B$2:$C$97,2)","v":{"$error":"#N/A"}}]
[null,null,null,null,63,32,0,{"$f":"VLOOKUP(A63,'Meldung (Reihung nach Spielnr.)'!$B$2:$C$97,2)","v":{"$error":"#N/A"}}]
[null,null,null,null,64,32,0,{"$f":"VLOOKUP(A64,'Meldung (Reihung nach Spielnr.)'!$B$2:$C$97,2)","v":{"$error":"#N/A"}}]
[null,null,null,null,65,33,0,{"$f":"VLOOKUP(A65,'Meldung (Reihung nach Spielnr.)'!$B$2:$C$97,2)","v":{"$error":"#N/A"}}]
[null,null,null,null,66,33,{"$f":"A66","v":0},{"$f":"VLOOKUP(A66,'Meldung (Reihung nach Spielnr.)'!$B$2:$C$97,2)","v":{"$error":"#N/A"}}]
[null,null,null,null,67,17,0,{"$f":"VLOOKUP(A67,'Meldung (Reihung nach Spielnr.)'!$B$2:$C$97,2)","v":{"$error":"#N/A"}}]
[null,null,null,null,68,34,0,{"$f":"VLOOKUP(A68,'Meldung (Reihung nach Spielnr.)'!$B$2:$C$97,2)","v":{"$error":"#N/A"}}]
[null,null,null,null,69,34,0,{"$f":"VLOOKUP(A69,'Meldung (Reihung nach Spielnr.)'!$B$2:$C$97,2)","v":{"$error":"#N/A"}}]
[null,null,null,null,70,35,0,{"$f":"VLOOKUP(A70,'Meldung (Reihung nach Spielnr.)'!$B$2:$C$97,2)","v":{"$error":"#N/A"}}]
[null,null,null,null,71,35,0,{"$f":"VLOOKUP(A71,'Meldung (Reihung nach Spielnr.)'!$B$2:$C$97,2)","v":{"$error":"#N/A"}}]
[null,null,null,null,72,36,0,{"$f":"VLOOKUP(A72,'Meldung (Reihung nach Spielnr.)'!$B$2:$C$97,2)","v":{"$error":"#N/A"}}]
[null,null,null,null,73,36,0,{"$f":"VLOOKUP(A73,'Meldung (Reihung nach Spielnr.)'!$B$2:$C$97,2)","v":{"$error":"#N/A"}}]
[null,null,null,null,74,36,0,{"$f":"VLOOKUP(A74,'Meldung (Reihung nach Spielnr.)'!$B$2:$C$97,2)","v":{"$error":"#N/A"}}]
[null,null,null,null,75,37,0,{"$f":"VLOOKUP(A75,'Meldung (Reihung nach Spielnr.)'!$B$2:$C$97,2)","v":{"$error":"#N/A"}}]
[null,null,null,null,76,37,0,{"$f":"VLOOKUP(A76,'Meldung (Reihung nach Spielnr.)'!$B$2:$C$97,2)","v":{"$error":"#N/A"}}]
[null,null,null,null,77,38,0,{"$f":"VLOOKUP(A77,'Meldung (Reihung nach Spielnr.)'!$B$2:$C$97,2)","v":{"$error":"#N/A"}}]
[null,null,null,null,78,38,0,{"$f":"VLOOKUP(A78,'Meldung (Reihung nach Spielnr.)'!$B$2:$C$97,2)","v":{"$error":"#N/A"}}]
[null,null,null,null,79,39,0,{"$f":"VLOOKUP(A79,'Meldung (Reihung nach Spielnr.)'!$B$2:$C$97,2)","v":{"$error":"#N/A"}}]
[null,null,null,null,80,39,0,{"$f":"VLOOKUP(A80,'Meldung (Reihung nach Spielnr.)'!$B$2:$C$97,2)","v":{"$error":"#N/A"}}]
[null,null,null,null,81,40,0,{"$f":"VLOOKUP(A81,'Meldung (Reihung nach Spielnr.)'!$B$2:$C$97,2)","v":{"$error":"#N/A"}}]
[null,null,null,null,82,40,0,{"$f":"VLOOKUP(A82,'Meldung (Reihung nach Spielnr.)'!$B$2:$C$97,2)","v":{"$error":"#N/A"}}]
[null,null,null,null,83,41,0,{"$f":"VLOOKUP(A83,'Meldung (Reihung nach Spielnr.)'!$B$2:$C$97,2)","v":{"$error":"#N/A"}}]
[null,null,null,null,84,41,0,{"$f":"VLOOKUP(A84,'Meldung (Reihung nach Spielnr.)'!$B$2:$C$97,2)","v":{"$error":"#N/A"}}]
[null,null,null,null,85,42,0,{"$f":"VLOOKUP(A85,'Meldung (Reihung nach Spielnr.)'!$B$2:$C$97,2)","v":{"$error":"#N/A"}}]
[null,null,null,null,86,42,0,{"$f":"VLOOKUP(A86,'Meldung (Reihung nach Spielnr.)'!$B$2:$C$97,2)","v":{"$error":"#N/A"}}]
[null,null,null,null,87,43,0,{"$f":"VLOOKUP(A87,'Meldung (Reihung nach Spielnr.)'!$B$2:$C$97,2)","v":{"$error":"#N/A"}}]
[null,null,null,null,88,4,0,{"$f":"VLOOKUP(A88,'Meldung (Reihung nach Spielnr.)'!$B$2:$C$97,2)","v":{"$error":"#N/A"}}]
[null,null,null,null,89,44,0,{"$f":"VLOOKUP(A89,'Meldung (Reihung nach Spielnr.)'!$B$2:$C$97,2)","v":{"$error":"#N/A"}}]
[null,null,null,null,90,44,0,{"$f":"VLOOKUP(A90,'Meldung (Reihung nach Spielnr.)'!$B$2:$C$97,2)","v":{"$error":"#N/A"}}]
[null,null,null,null,91,45,0,{"$f":"VLOOKUP(A91,'Meldung (Reihung nach Spielnr.)'!$B$2:$C$97,2)","v":{"$error":"#N/A"}}]
[null,null,null,null,92,45,0,{"$f":"VLOOKUP(A92,'Meldung (Reihung nach Spielnr.)'!$B$2:$C$97,2)","v":{"$error":"#N/A"}}]
[null,null,null,null,93,46,0,{"$f":"VLOOKUP(A93,'Meldung (Reihung nach Spielnr.)'!$B$2:$C$97,2)","v":{"$error":"#N/A"}}]
[null,null,null,null,94,46,0,{"$f":"VLOOKUP(A94,'Meldung (Reihung nach Spielnr.)'!$B$2:$C$97,2)","v":{"$error":"#N/A"}}]
[null,null,null,null,95,47,0,{"$f":"VLOOKUP(A95,'Meldung (Reihung nach Spielnr.)'!$B$2:$C$97,2)","v":{"$error":"#N/A"}}]
[null,null,null,null,96,47,0,{"$f":"VLOOKUP(A96,'Meldung (Reihung nach Spielnr.)'!$B$2:$C$97,2)","v":{"$error":"#N/A"}}]

{"sheet":"Runde 4","index":9,"n_rows":97,"n_cols":8,"rows_kept":97,"cut":false,"hidden":false,"merged":[[0,3,0,4]]}
["Spielnr.","Name","Runde 4",null,null,"Punkte","Punkte",15]
[{"$f":"Auslosung4!G2","v":17},{"$f":"Auslosung4!H2","v":"Karin Logar u Rudolf Häusler/Kematen"},{"$f":"IF(F3+G3>0,IF(H3=\"OK\",IF(F3<G3,F3,100+(F3-G3)),0),0)","v":112},null,null,{"$f":"VLOOKUP(A2,'Meldung (Reihung nach Spielnr.)'!$B$2:$C$97,2)","v":"Karin Logar u Rudolf Häusler/Kematen"},{"$f":"VLOOKUP(A3,'Meldung (Reihung nach Spielnr.)'!$B$2:$C$97,2)","v":"Edi u Gerald/Telfs"}]
[{"$f":"Auslosung4!G3","v":1},{"$f":"Auslosung4!H3","v":"Edi u Gerald/Telfs"},{"$f":"IF(F3+G3>0,IF(H3=\"OK\",IF(G3<F3,G3,100+(G3-F3)),0),0)","v":3},null,null,15,3,{"$f":"IF(OR(F3>=15,G3>=15),\"OK\",\"Fehlende oder falsche EIngabe\")","v":"OK"}]
[{"$f":"Auslosung4!G4","v":11},{"$f":"Auslosung4!H4","v":"Heini Gruber u Gottfried Geier/Südtirol"},{"$f":"IF(F5+G5>0,IF(H5=\"OK\",IF(F5<G5,F5,100+(F5-G5)),0),0)","v":0},null,null,{"$f":"VLOOKUP(A4,'Meldung (Reihung nach Spielnr.)'!$B$2:$C$97,2)","v":"Heini Gruber u Gottfried Geier/Südtirol"},{"$f":"VLOOKUP(A5,'Meldung (Reihung nach Spielnr.)'!$B$2:$C$97,2)","v":"Hubert Auer u Daniela Nöbauer/Telfs"}]
[{"$f":"Auslosung4!G5","v":3},{"$f":"Auslosung4!H5","v":"Hubert Auer u Daniela Nöbauer/Telfs"},{"$f":"IF(F5+G5>0,IF(H5=\"OK\",IF(G5<F5,G5,100+(G5-F5)),0),0)","v":0},null,null,null,0,{"$f":"IF(OR(F5>=15,G5>=15),\"OK\",\"Fehlende oder falsche EIngabe\")","v":"Fehlende oder falsche EIngabe"}]
[{"$f":"Auslosung4!G6","v":6},{"$f":"Auslosung4!H6","v":"Hans Perktold u Horst Friedl/Imst"},{"$f":"IF(F7+G7>0,IF(H7=\"OK\",IF(F7<G7,F7,100+(F7-G7)),0),0)","v":0},null,null,{"$f":"VLOOKUP(A6,'Meldung (Reihung nach Spielnr.)'!$B$2:$C$97,2)","v":"Hans Perktold u Horst Friedl/Imst"},{"$f":"VLOOKUP(A7,'Meldung (Reihung nach Spielnr.)'!$B$2:$C$97,2)","v":"Hermann Lechner u Andreas Oberacher/Kematen"}]
[{"$f":"Auslosung4!G7","v":16},{"$f":"Auslosung4!H7","v":"Hermann Lechner u Andreas Oberacher/Kematen"},{"$f":"IF(F7+G7>0,IF(H7=\"OK\",IF(G7<F7,G7,100+(G7-F7)),0),0)","v":0},null,null,null,null,{"$f":"IF(OR(F7>=15,G7>=15),\"OK\",\"Fehlende oder falsche EIngabe\")","v":"Fehlende oder falsche EIngabe"}]
[{"$f":"Auslosung4!G8","v":18},{"$f":"Auslosung4!H8","v":"Josef Eisenbeutl u Herbert Gamper/Imst"},{"$f":"IF(F9+G9>0,IF(H9=\"OK\",IF(F9<G9,F9,100+(F9-G9)),0),0)","v":0},null,null,{"$f":"VLOOKUP(A8,'Meldung (Reihung nach Spielnr.)'!$B$2:$C$97,2)","v":"Josef Eisenbeutl u Herbert Gamper/Imst"},{"$f":"VLOOKUP(A9,'Meldung (Reihung nach Spielnr.)'!$B$2:$C$97,2)","v":"Thomas Heltschl u Fredl Mungenast/Imst"}]
[{"$f":"Auslosung4!G9","v":7},{"$f":"Auslosung4!H9","v":"Thomas Heltschl u Fredl Mungenast/Imst"},{"$f":"IF(F9+G9>0,IF(H9=\"OK\",IF(G9<F9,G9,100+(G9-F9)),0),0)","v":0},null,null,null,null,{"$f":"IF(OR(F9>=15,G9>=15),\"OK\",\"Fehlende oder falsche EIngabe\")","v":"Fehlende oder falsche EIngabe"}]
[{"$f":"Auslosung4!G10","v":4},{"$f":"Auslosung4!H10","v":"Andi Krajic u Peter Doblander/Tarrenz"},{"$f":"IF(F11+G11>0,IF(H11=\"OK\",IF(F11<G11,F11,100+(F11-G11)),0),0)","v":0},null,null,{"$f":"VLOOKUP(A10,'Meldung (Reihung nach Spielnr.)'!$B$2:$C$97,2)","v":"Andi Krajic u Peter Doblander/Tarrenz"},{"$f":"VLOOKUP(A11,'Meldung (Reihung nach Spielnr.)'!$B$2:$C$97,2)","v":"Herbert Lechleitner u  Stefan Krabichler/Imst"}]
[{"$f":"Auslosung4!G11","v":8},{"$f":"Auslosung4!H11","v":"Herbert Lechleitner u  Stefan Krabichler/Imst"},{"$f":"IF(F11+G11>0,IF(H11=\"OK\",IF(G11<F11,G11,100+(G11-F11)),0),0)","v":0},null,null,null,0,{"$f":"IF(OR(F11>=15,G11>=15),\"OK\",\"Fehlende oder falsche EIngabe\")","v":"Fehlende oder falsche EIngabe"}]
[{"$f":"Auslosung4!G12","v":20},{"$f":"Auslosung4!H12","v":"Krissmer Reinhard | Fringer Fred"},{"$f":"IF(F13+G13>0,IF(H13=\"OK\",IF(F13<G13,F13,100+(F13-G13)),0),0)","v":0},null,null,{"$f":"VLOOKUP(A12,'Meldung (Reihung nach Spielnr.)'!$B$2:$C$97,2)","v":"Krissmer Reinhard | Fringer Fred"},{"$f":"VLOOKUP(A13,'Meldung (Reihung nach Spielnr.)'!$B$2:$C$97,2)","v":"Annette u Veronika/Telfs"}]
[{"$f":"Auslosung4!G13","v":2},{"$f":"Auslosung4!H13","v":"Annette u Veronika/Telfs"},{"$f":"IF(F13+G13>0,IF(H13=\"OK\",IF(G13<F13,G13,100+(G13-F13)),0),0)","v":0},null,null,null,0,{"$f":"IF(OR(F13>=15,G13>=15),\"OK\",\"Fehlende oder falsche EIngabe\")","v":"Fehlende oder falsche EIngabe"}]
[{"$f":"Auslosung4!G14","v":14},{"$f":"Auslosung4!H14","v":"Hansjörg Hell u Franz Braunegger/Axams"},{"$f":"IF(F15+G15>0,IF(H15=\"OK\",IF(F15<G15,F15,100+(F15-G15)),0),0)","v":0},null,null,{"$f":"VLOOKUP(A14,'Meldung (Reihung nach Spielnr.)'!$B$2:$C$97,2)","v":"Hansjörg Hell u Franz Braunegger/Axams"},{"$f":"VLOOKUP(A15,'Meldung (Reihung nach Spielnr.)'!$B$2:$C$97,2)","v":"Heinrich Ebner u Erich Peer/Südtirol"}]
[{"$f":"Auslosung4!G15","v":12},{"$f":"Auslosung4!H15","v":"Heinrich Ebner u Erich Peer/Südtirol"},{"$f":"IF(F15+G15>0,IF(H15=\"OK\",IF(G15<F15,G15,100+(G15-F15)),0),0)","v":0},null,null,null,0,{"$f":"IF(OR(F15>=15,G15>=15),\"OK\",\"Fehlende oder falsche EIngabe\")","v":"Fehlende oder falsche EIngabe"}]
[{"$f":"Auslosung4!G16","v":15},{"$f":"Auslosung4!H16","v":"Bernhard Meischberger u Martin Staggl/Kematen"},{"$f":"IF(F17+G17>0,IF(H17=\"OK\",IF(F17<G17,F17,100+(F17-G17)),0),0)","v":0},null,null,{"$f":"VLOOKUP(A16,'Meldung (Reihung nach Spielnr.)'!$B$2:$C$97,2)","v":"Bernhard Meischberger u Martin Staggl/Kematen"},{"$f":"VLOOKUP(A17,'Meldung (Reihung nach Spielnr.)'!$B$2:$C$97,2)","v":"Gerhard Schuler u Meinhard Eiter/Imst"}]
[{"$f":"Auslosung4!G17","v":5},{"$f":"Auslosung4!H17","v":"Gerhard Schuler u Meinhard Eiter/Imst"},{"$f":"IF(F17+G17>0,IF(H17=\"OK\",IF(G17<F17,G17,100+(G17-F17)),0),0)","v":0},null,null,null,0,{"$f":"IF(OR(F17>=15,G17>=15),\"OK\",\"Fehlende oder falsche EIngabe\")","v":"Fehlende oder falsche EIngabe"}]
[{"$f":"Auslosung4!G18","v":10},{"$f":"Auslosung4!H18","v":"Franz Pellegrini u Hans Matha/Südtirol"},{"$f":"IF(F19+G19>0,IF(H19=\"OK\",IF(F19<G19,F19,100+(F19-G19)),0),0)","v":0},null,null,{"$f":"VLOOKUP(A18,'Meldung (Reihung nach Spielnr.)'!$B$2:$C$97,2)","v":"Franz Pellegrini u Hans Matha/Südtirol"},{"$f":"VLOOKUP(A19,'Meldung (Reihung nach Spielnr.)'!$B$2:$C$97,2)","v":"Kurt Zebisch | Mr. Bean"}]
[{"$f":"Auslosung4!G19","v":19},{"$f":"Auslosung4!H19","v":"Kurt Zebisch | Mr. Bean"},{"$f":"IF(F19+G19>0,IF(H19=\"OK\",IF(G19<F19,G19,100+(G19-F19)),0),0)","v":0},null,null,null,null,{"$f":"IF(OR(F19>=15,G19>=15),\"OK\",\"Fehlende oder falsche EIngabe\")","v":"Fehlende oder falsche EIngabe"}]
[{"$f":"Auslosung4!G20","v":9},{"$f":"Auslosung4!H20","v":"Rudi Kastner u Peter Tschenett/Imst"},{"$f":"IF(F21+G21>0,IF(H21=\"OK\",IF(F21<G21,F21,100+(F21-G21)),0),0)","v":0},null,null,{"$f":"VLOOKUP(A20,'Meldung (Reihung nach Spielnr.)'!$B$2:$C$97,2)","v":"Rudi Kastner u Peter Tschenett/Imst"},{"$f":"VLOOKUP(A21,'Meldung (Reihung nach Spielnr.)'!$B$2:$C$97,2)","v":"Peter Auer u Stefan Sarg/Axams"}]
[{"$f":"Auslosung4!G21","v":13},{"$f":"Auslosung4!H21","v":"Peter Auer u Stefan Sarg/Axams"},{"$f":"IF(F21+G21>0,IF(H21=\"OK\",IF(G21<F21,G21,100+(G21-F21)),0),0)","v":0},null,null,null,null,{"$f":"IF(OR(F21>=15,G21>=15),\"OK\",\"Fehlende oder falsche EIngabe\")","v":"Fehlende oder falsche EIngabe"}]
[{"$f":"Auslosung4!G22","v":0},{"$f":"Auslosung4!H22","v":{"$error":"#N/A"}},{"$f":"IF(F23+G23>0,IF(H23=\"OK\",IF(F23<G23,F23,100+(F23-G23)),0),0)","v":0},null,null,{"$f":"VLOOKUP(A22,'Meldung (Reihung nach Spielnr.)'!$B$2:$C$97,2)","v":{"$error":"#N/A"}},{"$f":"VLOOKUP(A23,'Meldung (Reihung nach Spielnr.)'!$B$2:$C$97,2)","v":{"$error":"#N/A"}}]
[{"$f":"Auslosung4!G23","v":0},{"$f":"Auslosung4!H23","v":{"$error":"#N/A"}},{"$f":"IF(F23+G23>0,IF(H23=\"OK\",IF(G23<F23,G23,100+(G23-F23)),0),0)","v":0},null,null,null,0,{"$f":"IF(OR(F23>=15,G23>=15),\"OK\",\"Fehlende oder falsche EIngabe\")","v":"Fehlende oder falsche EIngabe"}]
[{"$f":"Auslosung4!G24","v":0},{"$f":"Auslosung4!H24","v":{"$error":"#N/A"}},{"$f":"IF(F25+G25>0,IF(H25=\"OK\",IF(F25<G25,F25,100+(F25-G25)),0),0)","v":0},null,null,{"$f":"VLOOKUP(A24,'Meldung (Reihung nach Spielnr.)'!$B$2:$C$97,2)","v":{"$error":"#N/A"}},{"$f":"VLOOKUP(A25,'Meldung (Reihung nach Spielnr.)'!$B$2:$C$97,2)","v":{"$error":"#N/A"}}]
[{"$f":"Auslosung4!G25","v":0},{"$f":"Auslosung4!H25","v":{"$error":"#N/A"}},{"$f":"IF(F25+G25>0,IF(H25=\"OK\",IF(G25<F25,G25,100+(G25-F25)),0),0)","v":0},null,null,null,0,{"$f":"IF(OR(F25>=15,G25>=15),\"OK\",\"Fehlende oder falsche EIngabe\")","v":"Fehlende oder falsche EIngabe"}]
[{"$f":"Auslosung4!G26","v":0},{"$f":"Auslosung4!H26","v":{"$error":"#N/A"}},{"$f":"IF(F27+G27>0,IF(H27=\"OK\",IF(F27<G27,F27,100+(F27-G27)),0),0)","v":0},null,null,{"$f":"VLOOKUP(A26,'Meldung (Reihung nach Spielnr.)'!$B$2:$C$97,2)","v":{"$error":"#N/A"}},{"$f":"VLOOKUP(A27,'Meldung (Reihung nach Spielnr.)'!$B$2:$C$97,2)","v":{"$error":"#N/A"}}]
[{"$f":"Auslosung4!G27","v":0},{"$f":"Auslosung4!H27","v":{"$error":"#N/A"}},{"$f":"IF(F27+G27>0,IF(H27=\"OK\",IF(G27<F27,G27,100+(G27-F27)),0),0)","v":0},null,null,null,0,{"$f":"IF(OR(F27>=15,G27>=15),\"OK\",\"Fehlende oder falsche EIngabe\")","v":"Fehlende oder falsche EIngabe"}]
[{"$f":"Auslosung4!G28","v":0},{"$f":"Auslosung4!H28","v":{"$error":"#N/A"}},{"$f":"IF(F29+G29>0,IF(H29=\"OK\",IF(F29<G29,F29,100+(F29-G29)),0),0)","v":0},null,null,{"$f":"VLOOKUP(A28,'Meldung (Reihung nach Spielnr.)'!$B$2:$C$97,2)","v":{"$error":"#N/A"}},{"$f":"VLOOKUP(A29,'Meldung (Reihung nach Spielnr.)'!$B$2:$C$97,2)","v":{"$error":"#N/A"}}]
[{"$f":"Auslosung4!G29","v":0},{"$f":"Auslosung4!H29","v":{"$error":"#N/A"}},{"$f":"IF(F29+G29>0,IF(H29=\"OK\",IF(G29<F29,G29,100+(G29-F29)),0),0)","v":0},null,null,null,0,{"$f":"IF(OR(F29>=15,G29>=15),\"OK\",\"Fehlende oder falsche EIngabe\")","v":"Fehlende oder falsche EIngabe"}]
[{"$f":"Auslosung4!G30","v":0},{"$f":"Auslosung4!H30","v":{"$error":"#N/A"}},{"$f":"IF(F31+G31>0,IF(H31=\"OK\",IF(F31<G31,F31,100+(F31-G31)),0),0)","v":0},null,null,{"$f":"VLOOKUP(A30,'Meldung (Reihung nach Spielnr.)'!$B$2:$C$97,2)","v":{"$error":"#N/A"}},{"$f":"VLOOKUP(A31,'Meldung (Reihung nach Spielnr.)'!$B$2:$C$97,2)","v":{"$error":"#N/A"}}]
[{"$f":"Auslosung4!G31","v":0},{"$f":"Auslosung4!H31","v":{"$error":"#N/A"}},{"$f":"IF(F31+G31>0,IF(H31=\"OK\",IF(G31<F31,G31,100+(G31-F31)),0),0)","v":0},null,null,null,0,{"$f":"IF(OR(F31>=15,G31>=15),\"OK\",\"Fehlende oder falsche EIngabe\")","v":"Fehlende oder falsche EIngabe"}]
[{"$f":"Auslosung4!G32","v":0},{"$f":"Auslosung4!H32","v":{"$error":"#N/A"}},{"$f":"IF(F33+G33>0,IF(H33=\"OK\",IF(F33<G33,F33,100+(F33-G33)),0),0)","v":0},null,null,{"$f":"VLOOKUP(A32,'Meldung (Reihung nach Spielnr.)'!$B$2:$C$97,2)","v":{"$error":"#N/A"}},{"$f":"VLOOKUP(A33,'Meldung (Reihung nach Spielnr.)'!$B$2:$C$97,2)","v":{"$error":"#N/A"}}]
[{"$f":"Auslosung4!G33","v":0},{"$f":"Auslosung4!H33","v":{"$error":"#N/A"}},{"$f":"IF(F33+G33>0,IF(H33=\"OK\",IF(G33<F33,G33,100+(G33-F33)),0),0)","v":0},null,null,null,0,{"$f":"IF(OR(F33>=15,G33>=15),\"OK\",\"Fehlende oder falsche EIngabe\")","v":"Fehlende oder falsche EIngabe"}]
[{"$f":"Auslosung4!G34","v":0},{"$f":"Auslosung4!H34","v":{"$error":"#N/A"}},{"$f":"IF(F35+G35>0,IF(H35=\"OK\",IF(F35<G35,F35,100+(F35-G35)),0),0)","v":0},null,null,{"$f":"VLOOKUP(A34,'Meldung (Reihung nach Spielnr.)'!$B$2:$C$97,2)","v":{"$error":"#N/A"}},{"$f":"VLOOKUP(A35,'Meldung (Reihung nach Spielnr.)'!$B$2:$C$97,2)","v":{"$error":"#N/A"}}]
[{"$f":"Auslosung4!G35","v":0},{"$f":"Auslosung4!H35","v":{"$error":"#N/A"}},{"$f":"IF(F35+G35>0,IF(H35=\"OK\",IF(G35<F35,G35,100+(G35-F35)),0),0)","v":0},null,null,null,0,{"$f":"IF(OR(F35>=15,G35>=15),\"OK\",\"Fehlende oder falsche EIngabe\")","v":"Fehlende oder falsche EIngabe"}]
[{"$f":"Auslosung4!G36","v":0},{"$f":"Auslosung4!H36","v":{"$error":"#N/A"}},{"$f":"IF(F37+G37>0,IF(H37=\"OK\",IF(F37<G37,F37,100+(F37-G37)),0),0)","v":0},null,null,{"$f":"VLOOKUP(A36,'Meldung (Reihung nach Spielnr.)'!$B$2:$C$97,2)","v":{"$error":"#N/A"}},{"$f":"VLOOKUP(A37,'Meldung (Reihung nach Spielnr.)'!$B$2:$C$97,2)","v":{"$error":"#N/A"}}]
[{"$f":"Auslosung4!G37","v":0},{"$f":"Auslosung4!H37","v":{"$error":"#N/A"}},{"$f":"IF(F37+G37>0,IF(H37=\"OK\",IF(G37<F37,G37,100+(G37-F37)),0),0)","v":0},null,null,null,0,{"$f":"IF(OR(F37>=15,G37>=15),\"OK\",\"Fehlende oder falsche EIngabe\")","v":"Fehlende oder falsche EIngabe"}]
[{"$f":"Auslosung4!G38","v":0},{"$f":"Auslosung4!H38","v":{"$error":"#N/A"}},{"$f":"IF(F39+G39>0,IF(H39=\"OK\",IF(F39<G39,F39,100+(F39-G39)),0),0)","v":0},null,null,{"$f":"VLOOKUP(A38,'Meldung (Reihung nach Spielnr.)'!$B$2:$C$97,2)","v":{"$error":"#N/A"}},{"$f":"VLOOKUP(A39,'Meldung (Reihung nach Spielnr.)'!$B$2:$C$97,2)","v":{"$error":"#N/A"}}]
[{"$f":"Auslosung4!G39","v":0},{"$f":"Auslosung4!H39","v":{"$error":"#N/A"}},{"$f":"IF(F39+G39>0,IF(H39=\"OK\",IF(G39<F39,G39,100+(G39-F39)),0),0)","v":0},null,null,null,0,{"$f":"IF(OR(F39>=15,G39>=15),\"OK\",\"Fehlende oder falsche EIngabe\")","v":"Fehlende oder falsche EIngabe"}]
[{"$f":"Auslosung4!G40","v":0},{"$f":"Auslosung4!H40","v":{"$error":"#N/A"}},{"$f":"IF(F41+G41>0,IF(H41=\"OK\",IF(F41<G41,F41,100+(F41-G41)),0),0)","v":0},null,null,{"$f":"VLOOKUP(A40,'Meldung (Reihung nach Spielnr.)'!$B$2:$C$97,2)","v":{"$error":"#N/A"}},{"$f":"VLOOKUP(A41,'Meldung (Reihung nach Spielnr.)'!$B$2:$C$97,2)","v":{"$error":"#N/A"}}]
[{"$f":"Auslosung4!G41","v":0},{"$f":"Auslosung4!H41","v":{"$error":"#N/A"}},{"$f":"IF(F41+G41>0,IF(H41=\"OK\",IF(G41<F41,G41,100+(G41-F41)),0),0)","v":0},null,null,null,0,{"$f":"IF(OR(F41>=15,G41>=15),\"OK\",\"Fehlende oder falsche EIngabe\")","v":"Fehlende oder falsche EIngabe"}]
[{"$f":"Auslosung4!G42","v":0},{"$f":"Auslosung4!H42","v":{"$error":"#N/A"}},{"$f":"IF(F43+G43>0,IF(H43=\"OK\",IF(F43<G43,F43,100+(F43-G43)),0),0)","v":0},null,null,{"$f":"VLOOKUP(A42,'Meldung (Reihung nach Spielnr.)'!$B$2:$C$97,2)","v":{"$error":"#N/A"}},{"$f":"VLOOKUP(A43,'Meldung (Reihung nach Spielnr.)'!$B$2:$C$97,2)","v":{"$error":"#N/A"}}]
[{"$f":"Auslosung4!G43","v":0},{"$f":"Auslosung4!H43","v":{"$error":"#N/A"}},{"$f":"IF(F43+G43>0,IF(H43=\"OK\",IF(G43<F43,G43,100+(G43-F43)),0),0)","v":0},null,null,null,0,{"$f":"IF(OR(F43>=15,G43>=15),\"OK\",\"Fehlende oder falsche EIngabe\")","v":"Fehlende oder falsche EIngabe"}]
[{"$f":"Auslosung4!G44","v":0},{"$f":"Auslosung4!H44","v":{"$error":"#N/A"}},{"$f":"IF(F45+G45>0,IF(H45=\"OK\",IF(F45<G45,F45,100+(F45-G45)),0),0)","v":0},null,null,{"$f":"VLOOKUP(A44,'Meldung (Reihung nach Spielnr.)'!$B$2:$C$97,2)","v":{"$error":"#N/A"}},{"$f":"VLOOKUP(A45,'Meldung (Reihung nach Spielnr.)'!$B$2:$C$97,2)","v":{"$error":"#N/A"}}]
[{"$f":"Auslosung4!G45","v":0},{"$f":"Auslosung4!H45","v":{"$error":"#N/A"}},{"$f":"IF(F45+G45>0,IF(H45=\"OK\",IF(G45<F45,G45,100+(G45-F45)),0),0)","v":0},null,null,null,0,{"$f":"IF(OR(F45>=15,G45>=15),\"OK\",\"Fehlende oder falsche EIngabe\")","v":"Fehlende oder falsche EIngabe"}]
[{"$f":"Auslosung4!G46","v":0},{"$f":"Auslosung4!H46","v":{"$error":"#N/A"}},{"$f":"IF(F47+G47>0,IF(H47=\"OK\",IF(F47<G47,F47,100+(F47-G47)),0),0)","v":0},null,null,{"$f":"VLOOKUP(A46,'Meldung (Reihung nach Spielnr.)'!$B$2:$C$97,2)","v":{"$error":"#N/A"}},{"$f":"VLOOKUP(A47,'Meldung (Reihung nach Spielnr.)'!$B$2:$C$97,2)","v":{"$error":"#N/A"}}]
[{"$f":"Auslosung4!G47","v":0},{"$f":"Auslosung4!H47","v":{"$error":"#N/A"}},{"$f":"IF(F47+G47>0,IF(H47=\"OK\",IF(G47<F47,G47,100+(G47-F47)),0),0)","v":0},null,null,null,0,{"$f":"IF(OR(F47>=15,G47>=15),\"OK\",\"Fehlende oder falsche EIngabe\")","v":"Fehlende oder falsche EIngabe"}]
[{"$f":"Auslosung4!G48","v":0},{"$f":"Auslosung4!H48","v":{"$error":"#N/A"}},{"$f":"IF(F49+G49>0,IF(H49=\"OK\",IF(F49<G49,F49,100+(F49-G49)),0),0)","v":0},null,null,{"$f":"VLOOKUP(A48,'Meldung (Reihung nach Spielnr.)'!$B$2:$C$97,2)","v":{"$error":"#N/A"}},{"$f":"VLOOKUP(A49,'Meldung (Reihung nach Spielnr.)'!$B$2:$C$97,2)","v":{"$error":"#N/A"}}]
[{"$f":"Auslosung4!G49","v":0},{"$f":"Auslosung4!H49","v":{"$error":"#N/A"}},{"$f":"IF(F49+G49>0,IF(H49=\"OK\",IF(G49<F49,G49,100+(G49-F49)),0),0)","v":0},null,null,null,0,{"$f":"IF(OR(F49>=15,G49>=15),\"OK\",\"Fehlende oder falsche EIngabe\")","v":"Fehlende oder falsche EIngabe"}]
[{"$f":"Auslosung4!G50","v":0},{"$f":"Auslosung4!H50","v":{"$error":"#N/A"}},{"$f":"IF(F51+G51>0,IF(H51=\"OK\",IF(F51<G51,F51,100+(F51-G51)),0),0)","v":0},null,null,{"$f":"VLOOKUP(A50,'Meldung (Reihung nach Spielnr.)'!$B$2:$C$97,2)","v":{"$error":"#N/A"}},{"$f":"VLOOKUP(A51,'Meldung (Reihung nach Spielnr.)'!$B$2:$C$97,2)","v":{"$error":"#N/A"}}]
[{"$f":"Auslosung4!G51","v":0},{"$f":"Auslosung4!H51","v":{"$error":"#N/A"}},{"$f":"IF(F51+G51>0,IF(H51=\"OK\",IF(G51<F51,G51,100+(G51-F51)),0),0)","v":0},null,null,null,0,{"$f":"IF(OR(F51>=15,G51>=15),\"OK\",\"Fehlende oder falsche EIngabe\")","v":"Fehlende oder falsche EIngabe"}]
[{"$f":"Auslosung4!G52","v":0},{"$f":"Auslosung4!H52","v":{"$error":"#N/A"}},{"$f":"IF(F53+G53>0,IF(H53=\"OK\",IF(F53<G53,F53,100+(F53-G53)),0),0)","v":0},null,null,{"$f":"VLOOKUP(A52,'Meldung (Reihung nach Spielnr.)'!$B$2:$C$97,2)","v":{"$error":"#N/A"}},{"$f":"VLOOKUP(A53,'Meldung (Reihung nach Spielnr.)'!$B$2:$C$97,2)","v":{"$error":"#N/A"}}]
[{"$f":"Auslosung4!G53","v":0},{"$f":"Auslosung4!H53","v":{"$error":"#N/A"}},{"$f":"IF(F53+G53>0,IF(H53=\"OK\",IF(G53<F53,G53,100+(G53-F53)),0),0)","v":0},null,null,null,0,{"$f":"IF(OR(F53>=15,G53>=15),\"OK\",\"Fehlende oder falsche EIngabe\")","v":"Fehlende oder falsche EIngabe"}]
[{"$f":"Auslosung4!G54","v":0},{"$f":"Auslosung4!H54","v":{"$error":"#N/A"}},{"$f":"IF(F55+G55>0,IF(H55=\"OK\",IF(F55<G55,F55,100+(F55-G55)),0),0)","v":0},null,null,{"$f":"VLOOKUP(A54,'Meldung (Reihung nach Spielnr.)'!$B$2:$C$97,2)","v":{"$error":"#N/A"}},{"$f":"VLOOKUP(A55,'Meldung (Reihung nach Spielnr.)'!$B$2:$C$97,2)","v":{"$error":"#N/A"}}]
[{"$f":"Auslosung4!G55","v":0},{"$f":"Auslosung4!H55","v":{"$error":"#N/A"}},{"$f":"IF(F55+G55>0,IF(H55=\"OK\",IF(G55<F55,G55,100+(G55-F55)),0),0)","v":0},null,null,null,0,{"$f":"IF(OR(F55>=15,G55>=15),\"OK\",\"Fehlende oder falsche EIngabe\")","v":"Fehlende oder falsche EIngabe"}]
[{"$f":"Auslosung4!G56","v":0},{"$f":"Auslosung4!H56","v":{"$error":"#N/A"}},{"$f":"IF(F57+G57>0,IF(H57=\"OK\",IF(F57<G57,F57,100+(F57-G57)),0),0)","v":0},null,null,{"$f":"VLOOKUP(A56,'Meldung (Reihung nach Spielnr.)'!$B$2:$C$97,2)","v":{"$error":"#N/A"}},{"$f":"VLOOKUP(A57,'Meldung (Reihung nach Spielnr.)'!$B$2:$C$97,2)","v":{"$error":"#N/A"}}]
[{"$f":"Auslosung4!G57","v":0},{"$f":"Auslosung4!H57","v":{"$error":"#N/A"}},{"$f":"IF(F57+G57>0,IF(H57=\"OK\",IF(G57<F57,G57,100+(G57-F57)),0),0)","v":0},null,null,null,0,{"$f":"IF(OR(F57>=15,G57>=15),\"OK\",\"Fehlende oder falsche EIngabe\")","v":"Fehlende oder falsche EIngabe"}]
[{"$f":"Auslosung4!G58","v":0},{"$f":"Auslosung4!H58","v":{"$error":"#N/A"}},{"$f":"IF(F59+G59>0,IF(H59=\"OK\",IF(F59<G59,F59,100+(F59-G59)),0),0)","v":0},null,null,{"$f":"VLOOKUP(A58,'Meldung (Reihung nach Spielnr.)'!$B$2:$C$97,2)","v":{"$error":"#N/A"}},{"$f":"VLOOKUP(A59,'Meldung (Reihung nach Spielnr.)'!$B$2:$C$97,2)","v":{"$error":"#N/A"}}]
[{"$f":"Auslosung4!G59","v":0},{"$f":"Auslosung4!H59","v":{"$error":"#N/A"}},{"$f":"IF(F59+G59>0,IF(H59=\"OK\",IF(G59<F59,G59,100+(G59-F59)),0),0)","v":0},null,null,null,0,{"$f":"IF(OR(F59>=15,G59>=15),\"OK\",\"Fehlende oder falsche EIngabe\")","v":"Fehlende oder falsche EIngabe"}]
[{"$f":"Auslosung4!G60","v":0},{"$f":"Auslosung4!H60","v":{"$error":"#N/A"}},{"$f":"IF(F61+G61>0,IF(H61=\"OK\",IF(F61<G61,F61,100+(F61-G61)),0),0)","v":0},null,null,{"$f":"VLOOKUP(A60,'Meldung (Reihung nach Spielnr.)'!$B$2:$C$97,2)","v":{"$error":"#N/A"}},{"$f":"VLOOKUP(A61,'Meldung (Reihung nach Spielnr.)'!$B$2:$C$97,2)","v":{"$error":"#N/A"}}]
[{"$f":"Auslosung4!G61","v":0},{"$f":"Auslosung4!H61","v":{"$error":"#N/A"}},{"$f":"IF(F61+G61>0,IF(H61=\"OK\",IF(G61<F61,G61,100+(G61-F61)),0),0)","v":0},null,null,null,0,{"$f":"IF(OR(F61>=15,G61>=15),\"OK\",\"Fehlende oder falsche EIngabe\")","v":"Fehlende oder falsche EIngabe"}]
[{"$f":"Auslosung4!G62","v":0},{"$f":"Auslosung4!H62","v":{"$error":"#N/A"}},{"$f":"IF(F63+G63>0,IF(H63=\"OK\",IF(F63<G63,F63,100+(F63-G63)),0),0)","v":0},null,null,{"$f":"VLOOKUP(A62,'Meldung (Reihung nach Spielnr.)'!$B$2:$C$97,2)","v":{"$error":"#N/A"}},{"$f":"VLOOKUP(A63,'Meldung (Reihung nach Spielnr.)'!$B$2:$C$97,2)","v":{"$error":"#N/A"}}]
[{"$f":"Auslosung4!G63","v":0},{"$f":"Auslosung4!H63","v":{"$error":"#N/A"}},{"$f":"IF(F63+G63>0,IF(H63=\"OK\",IF(G63<F63,G63,100+(G63-F63)),0),0)","v":0},null,null,null,0,{"$f":"IF(OR(F63>=15,G63>=15),\"OK\",\"Fehlende oder falsche EIngabe\")","v":"Fehlende oder falsche EIngabe"}]
[{"$f":"Auslosung4!G64","v":0},{"$f":"Auslosung4!H64","v":{"$error":"#N/A"}},{"$f":"IF(F65+G65>0,IF(H65=\"OK\",IF(F65<G65,F65,100+(F65-G65)),0),0)","v":0},null,null,{"$f":"VLOOKUP(A64,'Meldung (Reihung nach Spielnr.)'!$B$2:$C$97,2)","v":{"$error":"#N/A"}},{"$f":"VLOOKUP(A65,'Meldung (Reihung nach Spielnr.)'!$B$2:$C$97,2)","v":{"$error":"#N/A"}}]
[{"$f":"Auslosung4!G65","v":0},{"$f":"Auslosung4!H65","v":{"$error":"#N/A"}},{"$f":"IF(F65+G65>0,IF(H65=\"OK\",IF(G65<F65,G65,100+(G65-F65)),0),0)","v":0},null,null,null,0,{"$f":"IF(OR(F65>=15,G65>=15),\"OK\",\"Fehlende oder falsche EIngabe\")","v":"Fehlende oder falsche EIngabe"}]
[{"$f":"Auslosung4!G66","v":0},{"$f":"Auslosung4!H66","v":{"$error":"#N/A"}},{"$f":"IF(F67+G67>0,IF(H67=\"OK\",IF(F67<G67,F67,100+(F67-G67)),0),0)","v":0},null,null,{"$f":"VLOOKUP(A66,'Meldung (Reihung nach Spielnr.)'!$B$2:$C$97,2)","v":{"$error":"#N/A"}},{"$f":"VLOOKUP(A67,'Meldung (Reihung nach Spielnr.)'!$B$2:$C$97,2)","v":{"$error":"#N/A"}}]
[{"$f":"Auslosung4!G67","v":0},{"$f":"Auslosung4!H67","v":{"$error":"#N/A"}},{"$f":"IF(F67+G67>0,IF(H67=\"OK\",IF(G67<F67,G67,100+(G67-F67)),0),0)","v":0},null,null,null,0,{"$f":"IF(OR(F67>=15,G67>=15),\"OK\",\"Fehlende oder falsche EIngabe\")","v":"Fehlende oder falsche EIngabe"}]
[{"$f":"Auslosung4!G68","v":0},{"$f":"Auslosung4!H68","v":{"$error":"#N/A"}},{"$f":"IF(F69+G69>0,IF(H69=\"OK\",IF(F69<G69,F69,100+(F69-G69)),0),0)","v":0},null,null,{"$f":"VLOOKUP(A68,'Meldung (Reihung nach Spielnr.)'!$B$2:$C$97,2)","v":{"$error":"#N/A"}},{"$f":"VLOOKUP(A69,'Meldung (Reihung nach Spielnr.)'!$B$2:$C$97,2)","v":{"$error":"#N/A"}}]
[{"$f":"Auslosung4!G69","v":0},{"$f":"Auslosung4!H69","v":{"$error":"#N/A"}},{"$f":"IF(F69+G69>0,IF(H69=\"OK\",IF(G69<F69,G69,100+(G69-F69)),0),0)","v":0},null,null,null,0,{"$f":"IF(OR(F69>=15,G69>=15),\"OK\",\"Fehlende oder falsche EIngabe\")","v":"Fehlende oder falsche EIngabe"}]
[{"$f":"Auslosung4!G70","v":0},{"$f":"Auslosung4!H70","v":{"$error":"#N/A"}},{"$f":"IF(F71+G71>0,IF(H71=\"OK\",IF(F71<G71,F71,100+(F71-G71)),0),0)","v":0},null,null,{"$f":"VLOOKUP(A70,'Meldung (Reihung nach Spielnr.)'!$B$2:$C$97,2)","v":{"$error":"#N/A"}},{"$f":"VLOOKUP(A71,'Meldung (Reihung nach Spielnr.)'!$B$2:$C$97,2)","v":{"$error":"#N/A"}}]
[{"$f":"Auslosung4!G71","v":0},{"$f":"Auslosung4!H71","v":{"$error":"#N/A"}},{"$f":"IF(F71+G71>0,IF(H71=\"OK\",IF(G71<F71,G71,100+(G71-F71)),0),0)","v":0},null,null,null,0,{"$f":"IF(OR(F71>=15,G71>=15),\"OK\",\"Fehlende oder falsche EIngabe\")","v":"Fehlende oder falsche EIngabe"}]
[{"$f":"Auslosung4!G72","v":0},{"$f":"Auslosung4!H72","v":{"$error":"#N/A"}},{"$f":"IF(F73+G73>0,IF(H73=\"OK\",IF(F73<G73,F73,100+(F73-G73)),0),0)","v":0},null,null,{"$f":"VLOOKUP(A72,'Meldung (Reihung nach Spielnr.)'!$B$2:$C$97,2)","v":{"$error":"#N/A"}},{"$f":"VLOOKUP(A73,'Meldung (Reihung nach Spielnr.)'!$B$2:$C$97,2)","v":{"$error":"#N/A"}}]
[{"$f":"Auslosung4!G73","v":0},{"$f":"Auslosung4!H73","v":{"$error":"#N/A"}},{"$f":"IF(F73+G73>0,IF(H73=\"OK\",IF(G73<F73,G73,100+(G73-F73)),0),0)","v":0},null,null,null,0,{"$f":"IF(OR(F73>=15,G73>=15),\"OK\",\"Fehlende oder falsche EIngabe\")","v":"Fehlende oder falsche EIngabe"}]
[{"$f":"Auslosung4!G74","v":0},{"$f":"Auslosung4!H74","v":{"$error":"#N/A"}},{"$f":"IF(F75+G75>0,IF(H75=\"OK\",IF(F75<G75,F75,100+(F75-G75)),0),0)","v":0},null,null,{"$f":"VLOOKUP(A74,'Meldung (Reihung nach Spielnr.)'!$B$2:$C$97,2)","v":{"$error":"#N/A"}},{"$f":"VLOOKUP(A75,'Meldung (Reihung nach Spielnr.)'!$B$2:$C$97,2)","v":{"$error":"#N/A"}}]
[{"$f":"Auslosung4!G75","v":0},{"$f":"Auslosung4!H75","v":{"$error":"#N/A"}},{"$f":"IF(F75+G75>0,IF(H75=\"OK\",IF(G75<F75,G75,100+(G75-F75)),0),0)","v":0},null,null,null,0,{"$f":"IF(OR(F75>=15,G75>=15),\"OK\",\"Fehlende oder falsche EIngabe\")","v":"Fehlende oder falsche EIngabe"}]
[{"$f":"Auslosung4!G76","v":0},{"$f":"Auslosung4!H76","v":{"$error":"#N/A"}},{"$f":"IF(F77+G77>0,IF(H77=\"OK\",IF(F77<G77,F77,100+(F77-G77)),0),0)","v":0},null,null,{"$f":"VLOOKUP(A76,'Meldung (Reihung nach Spielnr.)'!$B$2:$C$97,2)","v":{"$error":"#N/A"}},{"$f":"VLOOKUP(A77,'Meldung (Reihung nach Spielnr.)'!$B$2:$C$97,2)","v":{"$error":"#N/A"}}]
[{"$f":"Auslosung4!G77","v":0},{"$f":"Auslosung4!H77","v":{"$error":"#N/A"}},{"$f":"IF(F77+G77>0,IF(H77=\"OK\",IF(G77<F77,G77,100+(G77-F77)),0),0)","v":0},null,null,null,0,{"$f":"IF(OR(F77>=15,G77>=15),\"OK\",\"Fehlende oder falsche EIngabe\")","v":"Fehlende oder falsche EIngabe"}]
[{"$f":"Auslosung4!G78","v":0},{"$f":"Auslosung4!H78","v":{"$error":"#N/A"}},{"$f":"IF(F79+G79>0,IF(H79=\"OK\",IF(F79<G79,F79,100+(F79-G79)),0),0)","v":0},null,null,{"$f":"VLOOKUP(A78,'Meldung (Reihung nach Spielnr.)'!$B$2:$C$97,2)","v":{"$error":"#N/A"}},{"$f":"VLOOKUP(A79,'Meldung (Reihung nach Spielnr.)'!$B$2:$C$97,2)","v":{"$error":"#N/A"}}]
[{"$f":"Auslosung4!G79","v":0},{"$f":"Auslosung4!H79","v":{"$error":"#N/A"}},{"$f":"IF(F79+G79>0,IF(H79=\"OK\",IF(G79<F79,G79,100+(G79-F79)),0),0)","v":0},null,null,null,0,{"$f":"IF(OR(F79>=15,G79>=15),\"OK\",\"Fehlende oder falsche EIngabe\")","v":"Fehlende oder falsche EIngabe"}]
[{"$f":"Auslosung4!G80","v":0},{"$f":"Auslosung4!H80","v":{"$error":"#N/A"}},{"$f":"IF(F81+G81>0,IF(H81=\"OK\",IF(F81<G81,F81,100+(F81-G81)),0),0)","v":0},null,null,{"$f":"VLOOKUP(A80,'Meldung (Reihung nach Spielnr.)'!$B$2:$C$97,2)","v":{"$error":"#N/A"}},{"$f":"VLOOKUP(A81,'Meldung (Reihung nach Spielnr.)'!$B$2:$C$97,2)","v":{"$error":"#N/A"}}]
[{"$f":"Auslosung4!G81","v":0},{"$f":"Auslosung4!H81","v":{"$error":"#N/A"}},{"$f":"IF(F81+G81>0,IF(H81=\"OK\",IF(G81<F81,G81,100+(G81-F81)),0),0)","v":0},null,null,null,0,{"$f":"IF(OR(F81>=15,G81>=15),\"OK\",\"Fehlende oder falsche EIngabe\")","v":"Fehlende oder falsche EIngabe"}]
[{"$f":"Auslosung4!G82","v":0},{"$f":"Auslosung4!H82","v":{"$error":"#N/A"}},{"$f":"IF(F83+G83>0,IF(H83=\"OK\",IF(F83<G83,F83,100+(F83-G83)),0),0)","v":0},null,null,{"$f":"VLOOKUP(A82,'Meldung (Reihung nach Spielnr.)'!$B$2:$C$97,2)","v":{"$error":"#N/A"}},{"$f":"VLOOKUP(A83,'Meldung (Reihung nach Spielnr.)'!$B$2:$C$97,2)","v":{"$error":"#N/A"}}]
[{"$f":"Auslosung4!G83","v":0},{"$f":"Auslosung4!H83","v":{"$error":"#N/A"}},{"$f":"IF(F83+G83>0,IF(H83=\"OK\",IF(G83<F83,G83,100+(G83-F83)),0),0)","v":0},null,null,null,0,{"$f":"IF(OR(F83>=15,G83>=15),\"OK\",\"Fehlende oder falsche EIngabe\")","v":"Fehlende oder falsche EIngabe"}]
[{"$f":"Auslosung4!G84","v":0},{"$f":"Auslosung4!H84","v":{"$error":"#N/A"}},{"$f":"IF(F85+G85>0,IF(H85=\"OK\",IF(F85<G85,F85,100+(F85-G85)),0),0)","v":0},null,null,{"$f":"VLOOKUP(A84,'Meldung (Reihung nach Spielnr.)'!$B$2:$C$97,2)","v":{"$error":"#N/A"}},{"$f":"VLOOKUP(A85,'Meldung (Reihung nach Spielnr.)'!$B$2:$C$97,2)","v":{"$error":"#N/A"}}]
[{"$f":"Auslosung4!G85","v":0},{"$f":"Auslosung4!H85","v":{"$error":"#N/A"}},{"$f":"IF(F85+G85>0,IF(H85=\"OK\",IF(G85<F85,G85,100+(G85-F85)),0),0)","v":0},null,null,null,0,{"$f":"IF(OR(F85>=15,G85>=15),\"OK\",\"Fehlende oder falsche EIngabe\")","v":"Fehlende oder falsche EIngabe"}]
[{"$f":"Auslosung4!G86","v":0},{"$f":"Auslosung4!H86","v":{"$error":"#N/A"}},{"$f":"IF(F87+G87>0,IF(H87=\"OK\",IF(F87<G87,F87,100+(F87-G87)),0),0)","v":0},null,null,{"$f":"VLOOKUP(A86,'Meldung (Reihung nach Spielnr.)'!$B$2:$C$97,2)","v":{"$error":"#N/A"}},{"$f":"VLOOKUP(A87,'Meldung (Reihung nach Spielnr.)'!$B$2:$C$97,2)","v":{"$error":"#N/A"}}]
[{"$f":"Auslosung4!G87","v":0},{"$f":"Auslosung4!H87","v":{"$error":"#N/A"}},{"$f":"IF(F87+G87>0,IF(H87=\"OK\",IF(G87<F87,G87,100+(G87-F87)),0),0)","v":0},null,null,null,0,{"$f":"IF(OR(F87>=15,G87>=15),\"OK\",\"Fehlende oder falsche EIngabe\")","v":"Fehlende oder falsche EIngabe"}]
[{"$f":"Auslosung4!G88","v":0},{"$f":"Auslosung4!H88","v":{"$error":"#N/A"}},{"$f":"IF(F89+G89>0,IF(H89=\"OK\",IF(F89<G89,F89,100+(F89-G89)),0),0)","v":0},null,null,{"$f":"VLOOKUP(A88,'Meldung (Reihung nach Spielnr.)'!$B$2:$C$97,2)","v":{"$error":"#N/A"}},{"$f":"VLOOKUP(A89,'Meldung (Reihung nach Spielnr.)'!$B$2:$C$97,2)","v":{"$error":"#N/A"}}]
[{"$f":"Auslosung4!G89","v":0},{"$f":"Auslosung4!H89","v":{"$error":"#N/A"}},{"$f":"IF(F89+G89>0,IF(H89=\"OK\",IF(G89<F89,G89,100+(G89-F89)),0),0)","v":0},null,null,null,0,{"$f":"IF(OR(F89>=15,G89>=15),\"OK\",\"Fehlende oder falsche EIngabe\")","v":"Fehlende oder falsche EIngabe"}]
[{"$f":"Auslosung4!G90","v":0},{"$f":"Auslosung4!H90","v":{"$error":"#N/A"}},{"$f":"IF(F91+G91>0,IF(H91=\"OK\",IF(F91<G91,F91,100+(F91-G91)),0),0)","v":0},null,null,{"$f":"VLOOKUP(A90,'Meldung (Reihung nach Spielnr.)'!$B$2:$C$97,2)","v":{"$error":"#N/A"}},{"$f":"VLOOKUP(A91,'Meldung (Reihung nach Spielnr.)'!$B$2:$C$97,2)","v":{"$error":"#N/A"}}]
[{"$f":"Auslosung4!G91","v":0},{"$f":"Auslosung4!H91","v":{"$error":"#N/A"}},{"$f":"IF(F91+G91>0,IF(H91=\"OK\",IF(G91<F91,G91,100+(G91-F91)),0),0)","v":0},null,null,null,0,{"$f":"IF(OR(F91>=15,G91>=15),\"OK\",\"Fehlende oder falsche EIngabe\")","v":"Fehlende oder falsche EIngabe"}]
[{"$f":"Auslosung4!G92","v":0},{"$f":"Auslosung4!H92","v":{"$error":"#N/A"}},{"$f":"IF(F93+G93>0,IF(H93=\"OK\",IF(F93<G93,F93,100+(F93-G93)),0),0)","v":0},null,null,{"$f":"VLOOKUP(A92,'Meldung (Reihung nach Spielnr.)'!$B$2:$C$97,2)","v":{"$error":"#N/A"}},{"$f":"VLOOKUP(A93,'Meldung (Reihung nach Spielnr.)'!$B$2:$C$97,2)","v":{"$error":"#N/A"}}]
[{"$f":"Auslosung4!G93","v":0},{"$f":"Auslosung4!H93","v":{"$error":"#N/A"}},{"$f":"IF(F93+G93>0,IF(H93=\"OK\",IF(G93<F93,G93,100+(G93-F93)),0),0)","v":0},null,null,null,0,{"$f":"IF(OR(F93>=15,G93>=15),\"OK\",\"Fehlende oder falsche EIngabe\")","v":"Fehlende oder falsche EIngabe"}]
[{"$f":"Auslosung4!G94","v":0},{"$f":"Auslosung4!H94","v":{"$error":"#N/A"}},{"$f":"IF(F95+G95>0,IF(H95=\"OK\",IF(F95<G95,F95,100+(F95-G95)),0),0)","v":0},null,null,{"$f":"VLOOKUP(A94,'Meldung (Reihung nach Spielnr.)'!$B$2:$C$97,2)","v":{"$error":"#N/A"}},{"$f":"VLOOKUP(A95,'Meldung (Reihung nach Spielnr.)'!$B$2:$C$97,2)","v":{"$error":"#N/A"}}]
[{"$f":"Auslosung4!G95","v":0},{"$f":"Auslosung4!H95","v":{"$error":"#N/A"}},{"$f":"IF(F95+G95>0,IF(H95=\"OK\",IF(G95<F95,G95,100+(G95-F95)),0),0)","v":0},null,null,null,0,{"$f":"IF(OR(F95>=15,G95>=15),\"OK\",\"Fehlende oder falsche EIngabe\")","v":"Fehlende oder falsche EIngabe"}]
[{"$f":"Auslosung4!G96","v":0},{"$f":"Auslosung4!H96","v":{"$error":"#N/A"}},{"$f":"IF(F97+G97>0,IF(H97=\"OK\",IF(F97<G97,F97,100+(F97-G97)),0),0)","v":1},null,null,{"$f":"VLOOKUP(A96,'Meldung (Reihung nach Spielnr.)'!$B$2:$C$97,2)","v":{"$error":"#N/A"}},{"$f":"VLOOKUP(A97,'Meldung (Reihung nach Spielnr.)'!$B$2:$C$97,2)","v":{"$error":"#N/A"}}]
[{"$f":"Auslosung4!G97","v":0},{"$f":"Auslosung4!H97","v":{"$error":"#N/A"}},{"$f":"IF(F97+G97>0,IF(H97=\"OK\",IF(G97<F97,G97,100+(G97-F97)),0),0)","v":114},null,null,1,15,{"$f":"IF(OR(F97>=15,G97>=15),\"OK\",\"Fehlende oder falsche EIngabe\")","v":"OK"}]

{"sheet":"Auslosung5","index":10,"n_rows":97,"n_cols":8,"rows_kept":97,"cut":false,"hidden":false,"merged":[]}
[19,"Geben Sie in die grüne Zelle, die Anzahl der Mitspieler ein",null,null,"Zahl","TISCH","Spieler Nr.","Name"]
[2,{"$f":"Auslosung1!B2","v":20},null,null,1,1,{"$f":"A1","v":19},{"$f":"VLOOKUP(A1,'Meldung (Reihung nach Spielnr.)'!$B$2:$C$97,2)","v":"Kurt Zebisch | Mr. Bean"}]
[4,{"$f":"'Meldung (Reihung nach Spielnr.)'!M1","v":20},null,null,2,1,{"$f":"A2","v":2},{"$f":"VLOOKUP(A2,'Meldung (Reihung nach Spielnr.)'!$B$2:$C$97,2)","v":"Annette u Veronika/Telfs"}]
[8,null,null,null,3,2,4,{"$f":"VLOOKUP(A3,'Meldung (Reihung nach Spielnr.)'!$B$2:$C$97,2)","v":"Andi Krajic u Peter Doblander/Tarrenz"}]
[15,null,null,null,4,2,8,{"$f":"VLOOKUP(A4,'Meldung (Reihung nach Spielnr.)'!$B$2:$C$97,2)","v":"Herbert Lechleitner u  Stefan Krabichler/Imst"}]
[5,null,null,null,5,3,15,{"$f":"VLOOKUP(A5,'Meldung (Reihung nach Spielnr.)'!$B$2:$C$97,2)","v":"Bernhard Meischberger u Martin Staggl/Kematen"}]
[13,null,null,null,6,3,5,{"$f":"VLOOKUP(A6,'Meldung (Reihung nach Spielnr.)'!$B$2:$C$97,2)","v":"Gerhard Schuler u Meinhard Eiter/Imst"}]
[18,null,null,null,7,4,13,{"$f":"VLOOKUP(A7,'Meldung (Reihung nach Spielnr.)'!$B$2:$C$97,2)","v":"Peter Auer u Stefan Sarg/Axams"}]
[16,null,null,null,8,4,18,{"$f":"VLOOKUP(A8,'Meldung (Reihung nach Spielnr.)'!$B$2:$C$97,2)","v":"Josef Eisenbeutl u Herbert Gamper/Imst"}]
[11,null,null,null,9,5,16,{"$f":"VLOOKUP(A9,'Meldung (Reihung nach Spielnr.)'!$B$2:$C$97,2)","v":"Hermann Lechner u Andreas Oberacher/Kematen"}]
[17,null,null,null,10,5,11,{"$f":"VLOOKUP(A10,'Meldung (Reihung nach Spielnr.)'!$B$2:$C$97,2)","v":"Heini Gruber u Gottfried Geier/Südtirol"}]
[3,null,null,null,11,6,17,{"$f":"VLOOKUP(A11,'Meldung (Reihung nach Spielnr.)'!$B$2:$C$97,2)","v":"Karin Logar u Rudolf Häusler/Kematen"}]
[10,null,null,null,12,6,3,{"$f":"VLOOKUP(A12,'Meldung (Reihung nach Spielnr.)'!$B$2:$C$97,2)","v":"Hubert Auer u Daniela Nöbauer/Telfs"}]
[20,null,null,null,13,7,10,{"$f":"VLOOKUP(A13,'Meldung (Reihung nach Spielnr.)'!$B$2:$C$97,2)","v":"Franz Pellegrini u Hans Matha/Südtirol"}]
[6,null,null,null,14,7,20,{"$f":"VLOOKUP(A14,'Meldung (Reihung nach Spielnr.)'!$B$2:$C$97,2)","v":"Krissmer Reinhard | Fringer Fred"}]
[7,null,null,null,15,8,6,{"$f":"VLOOKUP(A15,'Meldung (Reihung nach Spielnr.)'!$B$2:$C$97,2)","v":"Hans Perktold u Horst Friedl/Imst"}]
[9,null,null,null,16,8,7,{"$f":"VLOOKUP(A16,'Meldung (Reihung nach Spielnr.)'!$B$2:$C$97,2)","v":"Thomas Heltschl u Fredl Mungenast/Imst"}]
[1,null,null,null,17,9,9,{"$f":"VLOOKUP(A17,'Meldung (Reihung nach Spielnr.)'!$B$2:$C$97,2)","v":"Rudi Kastner u Peter Tschenett/Imst"}]
[14,null,null,null,18,9,1,{"$f":"VLOOKUP(A18,'Meldung (Reihung nach Spielnr.)'!$B$2:$C$97,2)","v":"Edi u Gerald/Telfs"}]
[12,null,null,null,19,10,14,{"$f":"VLOOKUP(A19,'Meldung (Reihung nach Spielnr.)'!$B$2:$C$97,2)","v":"Hansjörg Hell u Franz Braunegger/Axams"}]
[null,null,null,null,20,10,12,{"$f":"VLOOKUP(A20,'Meldung (Reihung nach Spielnr.)'!$B$2:$C$97,2)","v":"Heinrich Ebner u Erich Peer/Südtirol"}]
[null,null,null,null,21,11,0,{"$f":"VLOOKUP(A21,'Meldung (Reihung nach Spielnr.)'!$B$2:$C$97,2)","v":{"$error":"#N/A"}}]
[null,null,null,null,22,11,0,{"$f":"VLOOKUP(A22,'Meldung (Reihung nach Spielnr.)'!$B$2:$C$97,2)","v":{"$error":"#N/A"}}]
[null,null,null,null,23,12,0,{"$f":"VLOOKUP(A23,'Meldung (Reihung nach Spielnr.)'!$B$2:$C$97,2)","v":{"$error":"#N/A"}}]
[null,null,null,null,24,12,0,{"$f":"VLOOKUP(A24,'Meldung (Reihung nach Spielnr.)'!$B$2:$C$97,2)","v":{"$error":"#N/A"}}]
[null,null,null,null,25,13,0,{"$f":"VLOOKUP(A25,'Meldung (Reihung nach Spielnr.)'!$B$2:$C$97,2)","v":{"$error":"#N/A"}}]
[null,null,null,null,26,13,0,{"$f":"VLOOKUP(A26,'Meldung (Reihung nach Spielnr.)'!$B$2:$C$97,2)","v":{"$error":"#N/A"}}]
[null,null,null,null,27,14,0,{"$f":"VLOOKUP(A27,'Meldung (Reihung nach Spielnr.)'!$B$2:$C$97,2)","v":{"$error":"#N/A"}}]
[null,null,null,null,28,14,0,{"$f":"VLOOKUP(A28,'Meldung (Reihung nach Spielnr.)'!$B$2:$C$97,2)","v":{"$error":"#N/A"}}]
[null,null,null,null,29,15,0,{"$f":"VLOOKUP(A29,'Meldung (Reihung nach Spielnr.)'!$B$2:$C$97,2)","v":{"$error":"#N/A"}}]
[null,null,null,null,30,15,0,{"$f":"VLOOKUP(A30,'Meldung (Reihung nach Spielnr.)'!$B$2:$C$97,2)","v":{"$error":"#N/A"}}]
[null,null,null,null,31,16,0,{"$f":"VLOOKUP(A31,'Meldung (Reihung nach Spielnr.)'!$B$2:$C$97,2)","v":{"$error":"#N/A"}}]
[null,null,null,null,32,16,0,{"$f":"VLOOKUP(A32,'Meldung (Reihung nach Spielnr.)'!$B$2:$C$97,2)","v":{"$error":"#N/A"}}]
[null,null,null,null,33,17,0,{"$f":"VLOOKUP(A33,'Meldung (Reihung nach Spielnr.)'!$B$2:$C$97,2)","v":{"$error":"#N/A"}}]
[null,null,null,null,34,17,0,{"$f":"VLOOKUP(A34,'Meldung (Reihung nach Spielnr.)'!$B$2:$C$97,2)","v":{"$error":"#N/A"}}]
[null,null,null,null,35,18,0,{"$f":"VLOOKUP(A35,'Meldung (Reihung nach Spielnr.)'!$B$2:$C$97,2)","v":{"$error":"#N/A"}}]
[null,null,null,null,36,18,0,{"$f":"VLOOKUP(A36,'Meldung (Reihung nach Spielnr.)'!$B$2:$C$97,2)","v":{"$error":"#N/A"}}]
[null,null,null,null,37,19,0,{"$f":"VLOOKUP(A37,'Meldung (Reihung nach Spielnr.)'!$B$2:$C$97,2)","v":{"$error":"#N/A"}}]
[null,null,null,null,38,19,0,{"$f":"VLOOKUP(A38,'Meldung (Reihung nach Spielnr.)'!$B$2:$C$97,2)","v":{"$error":"#N/A"}}]
[null,null,null,null,39,20,0,{"$f":"VLOOKUP(A39,'Meldung (Reihung nach Spielnr.)'!$B$2:$C$97,2)","v":{"$error":"#N/A"}}]
[null,null,null,null,40,20,0,{"$f":"VLOOKUP(A40,'Meldung (Reihung nach Spielnr.)'!$B$2:$C$97,2)","v":{"$error":"#N/A"}}]
[null,null,null,null,41,21,0,{"$f":"VLOOKUP(A41,'Meldung (Reihung nach Spielnr.)'!$B$2:$C$97,2)","v":{"$error":"#N/A"}}]
[null,null,null,null,42,21,0,{"$f":"VLOOKUP(A42,'Meldung (Reihung nach Spielnr.)'!$B$2:$C$97,2)","v":{"$error":"#N/A"}}]
[null,null,null,null,43,22,0,{"$f":"VLOOKUP(A43,'Meldung (Reihung nach Spielnr.)'!$B$2:$C$97,2)","v":{"$error":"#N/A"}}]
[null,null,null,null,44,22,0,{"$f":"VLOOKUP(A44,'Meldung (Reihung nach Spielnr.)'!$B$2:$C$97,2)","v":{"$error":"#N/A"}}]
[null,null,null,null,45,23,0,{"$f":"VLOOKUP(A45,'Meldung (Reihung nach Spielnr.)'!$B$2:$C$97,2)","v":{"$error":"#N/A"}}]
[null,null,null,null,46,23,0,{"$f":"VLOOKUP(A46,'Meldung (Reihung nach Spielnr.)'!$B$2:$C$97,2)","v":{"$error":"#N/A"}}]
[null,null,null,null,47,24,0,{"$f":"VLOOKUP(A47,'Meldung (Reihung nach Spielnr.)'!$B$2:$C$97,2)","v":{"$error":"#N/A"}}]
[null,null,null,null,48,24,0,{"$f":"VLOOKUP(A48,'Meldung (Reihung nach Spielnr.)'!$B$2:$C$97,2)","v":{"$error":"#N/A"}}]
[null,null,null,null,49,25,0,{"$f":"VLOOKUP(A49,'Meldung (Reihung nach Spielnr.)'!$B$2:$C$97,2)","v":{"$error":"#N/A"}}]
[null,null,null,null,50,25,0,{"$f":"VLOOKUP(A50,'Meldung (Reihung nach Spielnr.)'!$B$2:$C$97,2)","v":{"$error":"#N/A"}}]
[null,null,null,null,51,26,0,{"$f":"VLOOKUP(A51,'Meldung (Reihung nach Spielnr.)'!$B$2:$C$97,2)","v":{"$error":"#N/A"}}]
[null,null,null,null,52,26,0,{"$f":"VLOOKUP(A52,'Meldung (Reihung nach Spielnr.)'!$B$2:$C$97,2)","v":{"$error":"#N/A"}}]
[null,null,null,null,53,27,0,{"$f":"VLOOKUP(A53,'Meldung (Reihung nach Spielnr.)'!$B$2:$C$97,2)","v":{"$error":"#N/A"}}]
[null,null,null,null,54,27,0,{"$f":"VLOOKUP(A54,'Meldung (Reihung nach Spielnr.)'!$B$2:$C$97,2)","v":{"$error":"#N/A"}}]
[null,null,null,null,55,28,0,{"$f":"VLOOKUP(A55,'Meldung (Reihung nach Spielnr.)'!$B$2:$C$97,2)","v":{"$error":"#N/A"}}]
[null,null,null,null,56,28,0,{"$f":"VLOOKUP(A56,'Meldung (Reihung nach Spielnr.)'!$B$2:$C$97,2)","v":{"$error":"#N/A"}}]
[null,null,null,null,57,29,0,{"$f":"VLOOKUP(A57,'Meldung (Reihung nach Spielnr.)'!$B$2:$C$97,2)","v":{"$error":"#N/A"}}]
[null,null,null,null,58,29,0,{"$f":"VLOOKUP(A58,'Meldung (Reihung nach Spielnr.)'!$B$2:$C$97,2)","v":{"$error":"#N/A"}}]
[null,null,null,null,59,30,0,{"$f":"VLOOKUP(A59,'Meldung (Reihung nach Spielnr.)'!$B$2:$C$97,2)","v":{"$error":"#N/A"}}]
[null,null,null,null,60,30,0,{"$f":"VLOOKUP(A60,'Meldung (Reihung nach Spielnr.)'!$B$2:$C$97,2)","v":{"$error":"#N/A"}}]
[null,null,null,null,61,31,0,{"$f":"VLOOKUP(A61,'Meldung (Reihung nach Spielnr.)'!$B$2:$C$97,2)","v":{"$error":"#N/A"}}]
[null,null,null,null,62,31,0,{"$f":"VLOOKUP(A62,'Meldung (Reihung nach Spielnr.)'!$B$2:$C$97,2)","v":{"$error":"#N/A"}}]
[null,null,null,null,63,32,0,{"$f":"VLOOKUP(A63,'Meldung (Reihung nach Spielnr.)'!$B$2:$C$97,2)","v":{"$error":"#N/A"}}]
[null,null,null,null,64,32,0,{"$f":"VLOOKUP(A64,'Meldung (Reihung nach Spielnr.)'!$B$2:$C$97,2)","v":{"$error":"#N/A"}}]
[null,null,null,null,65,33,0,{"$f":"VLOOKUP(A65,'Meldung (Reihung nach Spielnr.)'!$B$2:$C$97,2)","v":{"$error":"#N/A"}}]
[null,null,null,null,66,33,{"$f":"A66","v":0},{"$f":"VLOOKUP(A66,'Meldung (Reihung nach Spielnr.)'!$B$2:$C$97,2)","v":{"$error":"#N/A"}}]
[null,null,null,null,67,17,0,{"$f":"VLOOKUP(A67,'Meldung (Reihung nach Spielnr.)'!$B$2:$C$97,2)","v":{"$error":"#N/A"}}]
[null,null,null,null,68,34,0,{"$f":"VLOOKUP(A68,'Meldung (Reihung nach Spielnr.)'!$B$2:$C$97,2)","v":{"$error":"#N/A"}}]
[null,null,null,null,69,34,0,{"$f":"VLOOKUP(A69,'Meldung (Reihung nach Spielnr.)'!$B$2:$C$97,2)","v":{"$error":"#N/A"}}]
[null,null,null,null,70,35,0,{"$f":"VLOOKUP(A70,'Meldung (Reihung nach Spielnr.)'!$B$2:$C$97,2)","v":{"$error":"#N/A"}}]
[null,null,null,null,71,35,0,{"$f":"VLOOKUP(A71,'Meldung (Reihung nach Spielnr.)'!$B$2:$C$97,2)","v":{"$error":"#N/A"}}]
[null,null,null,null,72,36,0,{"$f":"VLOOKUP(A72,'Meldung (Reihung nach Spielnr.)'!$B$2:$C$97,2)","v":{"$error":"#N/A"}}]
[null,null,null,null,73,36,0,{"$f":"VLOOKUP(A73,'Meldung (Reihung nach Spielnr.)'!$B$2:$C$97,2)","v":{"$error":"#N/A"}}]
[null,null,null,null,74,36,0,{"$f":"VLOOKUP(A74,'Meldung (Reihung nach Spielnr.)'!$B$2:$C$97,2)","v":{"$error":"#N/A"}}]
[null,null,null,null,75,37,0,{"$f":"VLOOKUP(A75,'Meldung (Reihung nach Spielnr.)'!$B$2:$C$97,2)","v":{"$error":"#N/A"}}]
[null,null,null,null,76,37,0,{"$f":"VLOOKUP(A76,'Meldung (Reihung nach Spielnr.)'!$B$2:$C$97,2)","v":{"$error":"#N/A"}}]
[null,null,null,null,77,38,0,{"$f":"VLOOKUP(A77,'Meldung (Reihung nach Spielnr.)'!$B$2:$C$97,2)","v":{"$error":"#N/A"}}]
[null,null,null,null,78,38,0,{"$f":"VLOOKUP(A78,'Meldung (Reihung nach Spielnr.)'!$B$2:$C$97,2)","v":{"$error":"#N/A"}}]
[null,null,null,null,79,39,0,{"$f":"VLOOKUP(A79,'Meldung (Reihung nach Spielnr.)'!$B$2:$C$97,2)","v":{"$error":"#N/A"}}]
[null,null,null,null,80,39,0,{"$f":"VLOOKUP(A80,'Meldung (Reihung nach Spielnr.)'!$B$2:$C$97,2)","v":{"$error":"#N/A"}}]
[null,null,null,null,81,40,0,{"$f":"VLOOKUP(A81,'Meldung (Reihung nach Spielnr.)'!$B$2:$C$97,2)","v":{"$error":"#N/A"}}]
[null,null,null,null,82,40,0,{"$f":"VLOOKUP(A82,'Meldung (Reihung nach Spielnr.)'!$B$2:$C$97,2)","v":{"$error":"#N/A"}}]
[null,null,null,null,83,41,0,{"$f":"VLOOKUP(A83,'Meldung (Reihung nach Spielnr.)'!$B$2:$C$97,2)","v":{"$error":"#N/A"}}]
[null,null,null,null,84,41,0,{"$f":"VLOOKUP(A84,'Meldung (Reihung nach Spielnr.)'!$B$2:$C$97,2)","v":{"$error":"#N/A"}}]
[null,null,null,null,85,42,0,{"$f":"VLOOKUP(A85,'Meldung (Reihung nach Spielnr.)'!$B$2:$C$97,2)","v":{"$error":"#N/A"}}]
[null,null,null,null,86,42,0,{"$f":"VLOOKUP(A86,'Meldung (Reihung nach Spielnr.)'!$B$2:$C$97,2)","v":{"$error":"#N/A"}}]
[null,null,null,null,87,43,0,{"$f":"VLOOKUP(A87,'Meldung (Reihung nach Spielnr.)'!$B$2:$C$97,2)","v":{"$error":"#N/A"}}]
[null,null,null,null,88,4,0,{"$f":"VLOOKUP(A88,'Meldung (Reihung nach Spielnr.)'!$B$2:$C$97,2)","v":{"$error":"#N/A"}}]
[null,null,null,null,89,44,0,{"$f":"VLOOKUP(A89,'Meldung (Reihung nach Spielnr.)'!$B$2:$C$97,2)","v":{"$error":"#N/A"}}]
[null,null,null,null,90,44,0,{"$f":"VLOOKUP(A90,'Meldung (Reihung nach Spielnr.)'!$B$2:$C$97,2)","v":{"$error":"#N/A"}}]
[null,null,null,null,91,45,0,{"$f":"VLOOKUP(A91,'Meldung (Reihung nach Spielnr.)'!$B$2:$C$97,2)","v":{"$error":"#N/A"}}]
[null,null,null,null,92,45,0,{"$f":"VLOOKUP(A92,'Meldung (Reihung nach Spielnr.)'!$B$2:$C$97,2)","v":{"$error":"#N/A"}}]
[null,null,null,null,93,46,0,{"$f":"VLOOKUP(A93,'Meldung (Reihung nach Spielnr.)'!$B$2:$C$97,2)","v":{"$error":"#N/A"}}]
[null,null,null,null,94,46,0,{"$f":"VLOOKUP(A94,'Meldung (Reihung nach Spielnr.)'!$B$2:$C$97,2)","v":{"$error":"#N/A"}}]
[null,null,null,null,95,47,0,{"$f":"VLOOKUP(A95,'Meldung (Reihung nach Spielnr.)'!$B$2:$C$97,2)","v":{"$error":"#N/A"}}]
[null,null,null,null,96,47,0,{"$f":"VLOOKUP(A96,'Meldung (Reihung nach Spielnr.)'!$B$2:$C$97,2)","v":{"$error":"#N/A"}}]

{"sheet":"Runde 5","index":11,"n_rows":97,"n_cols":8,"rows_kept":97,"cut":false,"hidden":false,"merged":[[0,3,0,4]]}
["Spielnr.","Name","Runde 5",null,null,"Punkte","Punkte",15]
[{"$f":"Auslosung5!G2","v":19},{"$f":"Auslosung5!H2","v":"Kurt Zebisch | Mr. Bean"},{"$f":"IF(F3+G3>0,IF(H3=\"OK\",IF(F3<G3,F3,100+(F3-G3)),0),0)","v":0},null,null,{"$f":"VLOOKUP(A2,'Meldung (Reihung nach Spielnr.)'!$B$2:$C$97,2)","v":"Kurt Zebisch | Mr. Bean"},{"$f":"VLOOKUP(A3,'Meldung (Reihung nach Spielnr.)'!$B$2:$C$97,2)","v":"Annette u Veronika/Telfs"}]
[{"$f":"Auslosung5!G3","v":2},{"$f":"Auslosung5!H3","v":"Annette u Veronika/Telfs"},{"$f":"IF(F3+G3>0,IF(H3=\"OK\",IF(G3<F3,G3,100+(G3-F3)),0),0)","v":0},null,null,null,null,{"$f":"IF(OR(F3>=15,G3>=15),\"OK\",\"Fehlende oder falsche EIngabe\")","v":"Fehlende oder falsche EIngabe"}]
[{"$f":"Auslosung5!G4","v":4},{"$f":"Auslosung5!H4","v":"Andi Krajic u Peter Doblander/Tarrenz"},{"$f":"IF(F5+G5>0,IF(H5=\"OK\",IF(F5<G5,F5,100+(F5-G5)),0),0)","v":0},null,null,{"$f":"VLOOKUP(A4,'Meldung (Reihung nach Spielnr.)'!$B$2:$C$97,2)","v":"Andi Krajic u Peter Doblander/Tarrenz"},{"$f":"VLOOKUP(A5,'Meldung (Reihung nach Spielnr.)'!$B$2:$C$97,2)","v":"Herbert Lechleitner u  Stefan Krabichler/Imst"}]
[{"$f":"Auslosung5!G5","v":8},{"$f":"Auslosung5!H5","v":"Herbert Lechleitner u  Stefan Krabichler/Imst"},{"$f":"IF(F5+G5>0,IF(H5=\"OK\",IF(G5<F5,G5,100+(G5-F5)),0),0)","v":0},null,null,null,null,{"$f":"IF(OR(F5>=15,G5>=15),\"OK\",\"Fehlende oder falsche EIngabe\")","v":"Fehlende oder falsche EIngabe"}]
[{"$f":"Auslosung5!G6","v":15},{"$f":"Auslosung5!H6","v":"Bernhard Meischberger u Martin Staggl/Kematen"},{"$f":"IF(F7+G7>0,IF(H7=\"OK\",IF(F7<G7,F7,100+(F7-G7)),0),0)","v":0},null,null,{"$f":"VLOOKUP(A6,'Meldung (Reihung nach Spielnr.)'!$B$2:$C$97,2)","v":"Bernhard Meischberger u Martin Staggl/Kematen"},{"$f":"VLOOKUP(A7,'Meldung (Reihung nach Spielnr.)'!$B$2:$C$97,2)","v":"Gerhard Schuler u Meinhard Eiter/Imst"}]
[{"$f":"Auslosung5!G7","v":5},{"$f":"Auslosung5!H7","v":"Gerhard Schuler u Meinhard Eiter/Imst"},{"$f":"IF(F7+G7>0,IF(H7=\"OK\",IF(G7<F7,G7,100+(G7-F7)),0),0)","v":0},null,null,null,null,{"$f":"IF(OR(F7>=15,G7>=15),\"OK\",\"Fehlende oder falsche EIngabe\")","v":"Fehlende oder falsche EIngabe"}]
[{"$f":"Auslosung5!G8","v":13},{"$f":"Auslosung5!H8","v":"Peter Auer u Stefan Sarg/Axams"},{"$f":"IF(F9+G9>0,IF(H9=\"OK\",IF(F9<G9,F9,100+(F9-G9)),0),0)","v":0},null,null,{"$f":"VLOOKUP(A8,'Meldung (Reihung nach Spielnr.)'!$B$2:$C$97,2)","v":"Peter Auer u Stefan Sarg/Axams"},{"$f":"VLOOKUP(A9,'Meldung (Reihung nach Spielnr.)'!$B$2:$C$97,2)","v":"Josef Eisenbeutl u Herbert Gamper/Imst"}]
[{"$f":"Auslosung5!G9","v":18},{"$f":"Auslosung5!H9","v":"Josef Eisenbeutl u Herbert Gamper/Imst"},{"$f":"IF(F9+G9>0,IF(H9=\"OK\",IF(G9<F9,G9,100+(G9-F9)),0),0)","v":0},null,null,null,null,{"$f":"IF(OR(F9>=15,G9>=15),\"OK\",\"Fehlende oder falsche EIngabe\")","v":"Fehlende oder falsche EIngabe"}]
[{"$f":"Auslosung5!G10","v":16},{"$f":"Auslosung5!H10","v":"Hermann Lechner u Andreas Oberacher/Kematen"},{"$f":"IF(F11+G11>0,IF(H11=\"OK\",IF(F11<G11,F11,100+(F11-G11)),0),0)","v":0},null,null,{"$f":"VLOOKUP(A10,'Meldung (Reihung nach Spielnr.)'!$B$2:$C$97,2)","v":"Hermann Lechner u Andreas Oberacher/Kematen"},{"$f":"VLOOKUP(A11,'Meldung (Reihung nach Spielnr.)'!$B$2:$C$97,2)","v":"Heini Gruber u Gottfried Geier/Südtirol"}]
[{"$f":"Auslosung5!G11","v":11},{"$f":"Auslosung5!H11","v":"Heini Gruber u Gottfried Geier/Südtirol"},{"$f":"IF(F11+G11>0,IF(H11=\"OK\",IF(G11<F11,G11,100+(G11-F11)),0),0)","v":0},null,null,null,0,{"$f":"IF(OR(F11>=15,G11>=15),\"OK\",\"Fehlende oder falsche EIngabe\")","v":"Fehlende oder falsche EIngabe"}]
[{"$f":"Auslosung5!G12","v":17},{"$f":"Auslosung5!H12","v":"Karin Logar u Rudolf Häusler/Kematen"},{"$f":"IF(F13+G13>0,IF(H13=\"OK\",IF(F13<G13,F13,100+(F13-G13)),0),0)","v":0},null,null,{"$f":"VLOOKUP(A12,'Meldung (Reihung nach Spielnr.)'!$B$2:$C$97,2)","v":"Karin Logar u Rudolf Häusler/Kematen"},{"$f":"VLOOKUP(A13,'Meldung (Reihung nach Spielnr.)'!$B$2:$C$97,2)","v":"Hubert Auer u Daniela Nöbauer/Telfs"}]
[{"$f":"Auslosung5!G13","v":3},{"$f":"Auslosung5!H13","v":"Hubert Auer u Daniela Nöbauer/Telfs"},{"$f":"IF(F13+G13>0,IF(H13=\"OK\",IF(G13<F13,G13,100+(G13-F13)),0),0)","v":0},null,null,null,0,{"$f":"IF(OR(F13>=15,G13>=15),\"OK\",\"Fehlende oder falsche EIngabe\")","v":"Fehlende oder falsche EIngabe"}]
[{"$f":"Auslosung5!G14","v":10},{"$f":"Auslosung5!H14","v":"Franz Pellegrini u Hans Matha/Südtirol"},{"$f":"IF(F15+G15>0,IF(H15=\"OK\",IF(F15<G15,F15,100+(F15-G15)),0),0)","v":0},null,null,{"$f":"VLOOKUP(A14,'Meldung (Reihung nach Spielnr.)'!$B$2:$C$97,2)","v":"Franz Pellegrini u Hans Matha/Südtirol"},{"$f":"VLOOKUP(A15,'Meldung (Reihung nach Spielnr.)'!$B$2:$C$97,2)","v":"Krissmer Reinhard | Fringer Fred"}]
[{"$f":"Auslosung5!G15","v":20},{"$f":"Auslosung5!H15","v":"Krissmer Reinhard | Fringer Fred"},{"$f":"IF(F15+G15>0,IF(H15=\"OK\",IF(G15<F15,G15,100+(G15-F15)),0),0)","v":0},null,null,null,0,{"$f":"IF(OR(F15>=15,G15>=15),\"OK\",\"Fehlende oder falsche EIngabe\")","v":"Fehlende oder falsche EIngabe"}]
[{"$f":"Auslosung5!G16","v":6},{"$f":"Auslosung5!H16","v":"Hans Perktold u Horst Friedl/Imst"},{"$f":"IF(F17+G17>0,IF(H17=\"OK\",IF(F17<G17,F17,100+(F17-G17)),0),0)","v":0},null,null,{"$f":"VLOOKUP(A16,'Meldung (Reihung nach Spielnr.)'!$B$2:$C$97,2)","v":"Hans Perktold u Horst Friedl/Imst"},{"$f":"VLOOKUP(A17,'Meldung (Reihung nach Spielnr.)'!$B$2:$C$97,2)","v":"Thomas Heltschl u Fredl Mungenast/Imst"}]
[{"$f":"Auslosung5!G17","v":7},{"$f":"Auslosung5!H17","v":"Thomas Heltschl u Fredl Mungenast/Imst"},{"$f":"IF(F17+G17>0,IF(H17=\"OK\",IF(G17<F17,G17,100+(G17-F17)),0),0)","v":0},null,null,null,0,{"$f":"IF(OR(F17>=15,G17>=15),\"OK\",\"Fehlende oder falsche EIngabe\")","v":"Fehlende oder falsche EIngabe"}]
[{"$f":"Auslosung5!G18","v":9},{"$f":"Auslosung5!H18","v":"Rudi Kastner u Peter Tschenett/Imst"},{"$f":"IF(F19+G19>0,IF(H19=\"OK\",IF(F19<G19,F19,100+(F19-G19)),0),0)","v":0},null,null,{"$f":"VLOOKUP(A18,'Meldung (Reihung nach Spielnr.)'!$B$2:$C$97,2)","v":"Rudi Kastner u Peter Tschenett/Imst"},{"$f":"VLOOKUP(A19,'Meldung (Reihung nach Spielnr.)'!$B$2:$C$97,2)","v":"Edi u Gerald/Telfs"}]
[{"$f":"Auslosung5!G19","v":1},{"$f":"Auslosung5!H19","v":"Edi u Gerald/Telfs"},{"$f":"IF(F19+G19>0,IF(H19=\"OK\",IF(G19<F19,G19,100+(G19-F19)),0),0)","v":0},null,null,null,null,{"$f":"IF(OR(F19>=15,G19>=15),\"OK\",\"Fehlende oder falsche EIngabe\")","v":"Fehlende oder falsche EIngabe"}]
[{"$f":"Auslosung5!G20","v":14},{"$f":"Auslosung5!H20","v":"Hansjörg Hell u Franz Braunegger/Axams"},{"$f":"IF(F21+G21>0,IF(H21=\"OK\",IF(F21<G21,F21,100+(F21-G21)),0),0)","v":0},null,null,{"$f":"VLOOKUP(A20,'Meldung (Reihung nach Spielnr.)'!$B$2:$C$97,2)","v":"Hansjörg Hell u Franz Braunegger/Axams"},{"$f":"VLOOKUP(A21,'Meldung (Reihung nach Spielnr.)'!$B$2:$C$97,2)","v":"Heinrich Ebner u Erich Peer/Südtirol"}]
[{"$f":"Auslosung5!G21","v":12},{"$f":"Auslosung5!H21","v":"Heinrich Ebner u Erich Peer/Südtirol"},{"$f":"IF(F21+G21>0,IF(H21=\"OK\",IF(G21<F21,G21,100+(G21-F21)),0),0)","v":0},null,null,null,null,{"$f":"IF(OR(F21>=15,G21>=15),\"OK\",\"Fehlende oder falsche EIngabe\")","v":"Fehlende oder falsche EIngabe"}]
[{"$f":"Auslosung5!G22","v":0},{"$f":"Auslosung5!H22","v":{"$error":"#N/A"}},{"$f":"IF(F23+G23>0,IF(H23=\"OK\",IF(F23<G23,F23,100+(F23-G23)),0),0)","v":0},null,null,{"$f":"VLOOKUP(A22,'Meldung (Reihung nach Spielnr.)'!$B$2:$C$97,2)","v":{"$error":"#N/A"}},{"$f":"VLOOKUP(A23,'Meldung (Reihung nach Spielnr.)'!$B$2:$C$97,2)","v":{"$error":"#N/A"}}]
[{"$f":"Auslosung5!G23","v":0},{"$f":"Auslosung5!H23","v":{"$error":"#N/A"}},{"$f":"IF(F23+G23>0,IF(H23=\"OK\",IF(G23<F23,G23,100+(G23-F23)),0),0)","v":0},null,null,null,0,{"$f":"IF(OR(F23>=15,G23>=15),\"OK\",\"Fehlende oder falsche EIngabe\")","v":"Fehlende oder falsche EIngabe"}]
[{"$f":"Auslosung5!G24","v":0},{"$f":"Auslosung5!H24","v":{"$error":"#N/A"}},{"$f":"IF(F25+G25>0,IF(H25=\"OK\",IF(F25<G25,F25,100+(F25-G25)),0),0)","v":0},null,null,{"$f":"VLOOKUP(A24,'Meldung (Reihung nach Spielnr.)'!$B$2:$C$97,2)","v":{"$error":"#N/A"}},{"$f":"VLOOKUP(A25,'Meldung (Reihung nach Spielnr.)'!$B$2:$C$97,2)","v":{"$error":"#N/A"}}]
[{"$f":"Auslosung5!G25","v":0},{"$f":"Auslosung5!H25","v":{"$error":"#N/A"}},{"$f":"IF(F25+G25>0,IF(H25=\"OK\",IF(G25<F25,G25,100+(G25-F25)),0),0)","v":0},null,null,null,0,{"$f":"IF(OR(F25>=15,G25>=15),\"OK\",\"Fehlende oder falsche EIngabe\")","v":"Fehlende oder falsche EIngabe"}]
[{"$f":"Auslosung5!G26","v":0},{"$f":"Auslosung5!H26","v":{"$error":"#N/A"}},{"$f":"IF(F27+G27>0,IF(H27=\"OK\",IF(F27<G27,F27,100+(F27-G27)),0),0)","v":0},null,null,{"$f":"VLOOKUP(A26,'Meldung (Reihung nach Spielnr.)'!$B$2:$C$97,2)","v":{"$error":"#N/A"}},{"$f":"VLOOKUP(A27,'Meldung (Reihung nach Spielnr.)'!$B$2:$C$97,2)","v":{"$error":"#N/A"}}]
[{"$f":"Auslosung5!G27","v":0},{"$f":"Auslosung5!H27","v":{"$error":"#N/A"}},{"$f":"IF(F27+G27>0,IF(H27=\"OK\",IF(G27<F27,G27,100+(G27-F27)),0),0)","v":0},null,null,null,0,{"$f":"IF(OR(F27>=15,G27>=15),\"OK\",\"Fehlende oder falsche EIngabe\")","v":"Fehlende oder falsche EIngabe"}]
[{"$f":"Auslosung5!G28","v":0},{"$f":"Auslosung5!H28","v":{"$error":"#N/A"}},{"$f":"IF(F29+G29>0,IF(H29=\"OK\",IF(F29<G29,F29,100+(F29-G29)),0),0)","v":0},null,null,{"$f":"VLOOKUP(A28,'Meldung (Reihung nach Spielnr.)'!$B$2:$C$97,2)","v":{"$error":"#N/A"}},{"$f":"VLOOKUP(A29,'Meldung (Reihung nach Spielnr.)'!$B$2:$C$97,2)","v":{"$error":"#N/A"}}]
[{"$f":"Auslosung5!G29","v":0},{"$f":"Auslosung5!H29","v":{"$error":"#N/A"}},{"$f":"IF(F29+G29>0,IF(H29=\"OK\",IF(G29<F29,G29,100+(G29-F29)),0),0)","v":0},null,null,null,0,{"$f":"IF(OR(F29>=15,G29>=15),\"OK\",\"Fehlende oder falsche EIngabe\")","v":"Fehlende oder falsche EIngabe"}]
[{"$f":"Auslosung5!G30","v":0},{"$f":"Auslosung5!H30","v":{"$error":"#N/A"}},{"$f":"IF(F31+G31>0,IF(H31=\"OK\",IF(F31<G31,F31,100+(F31-G31)),0),0)","v":0},null,null,{"$f":"VLOOKUP(A30,'Meldung (Reihung nach Spielnr.)'!$B$2:$C$97,2)","v":{"$error":"#N/A"}},{"$f":"VLOOKUP(A31,'Meldung (Reihung nach Spielnr.)'!$B$2:$C$97,2)","v":{"$error":"#N/A"}}]
[{"$f":"Auslosung5!G31","v":0},{"$f":"Auslosung5!H31","v":{"$error":"#N/A"}},{"$f":"IF(F31+G31>0,IF(H31=\"OK\",IF(G31<F31,G31,100+(G31-F31)),0),0)","v":0},null,null,null,0,{"$f":"IF(OR(F31>=15,G31>=15),\"OK\",\"Fehlende oder falsche EIngabe\")","v":"Fehlende oder falsche EIngabe"}]
[{"$f":"Auslosung5!G32","v":0},{"$f":"Auslosung5!H32","v":{"$error":"#N/A"}},{"$f":"IF(F33+G33>0,IF(H33=\"OK\",IF(F33<G33,F33,100+(F33-G33)),0),0)","v":0},null,null,{"$f":"VLOOKUP(A32,'Meldung (Reihung nach Spielnr.)'!$B$2:$C$97,2)","v":{"$error":"#N/A"}},{"$f":"VLOOKUP(A33,'Meldung (Reihung nach Spielnr.)'!$B$2:$C$97,2)","v":{"$error":"#N/A"}}]
[{"$f":"Auslosung5!G33","v":0},{"$f":"Auslosung5!H33","v":{"$error":"#N/A"}},{"$f":"IF(F33+G33>0,IF(H33=\"OK\",IF(G33<F33,G33,100+(G33-F33)),0),0)","v":0},null,null,null,0,{"$f":"IF(OR(F33>=15,G33>=15),\"OK\",\"Fehlende oder falsche EIngabe\")","v":"Fehlende oder falsche EIngabe"}]
[{"$f":"Auslosung5!G34","v":0},{"$f":"Auslosung5!H34","v":{"$error":"#N/A"}},{"$f":"IF(F35+G35>0,IF(H35=\"OK\",IF(F35<G35,F35,100+(F35-G35)),0),0)","v":0},null,null,{"$f":"VLOOKUP(A34,'Meldung (Reihung nach Spielnr.)'!$B$2:$C$97,2)","v":{"$error":"#N/A"}},{"$f":"VLOOKUP(A35,'Meldung (Reihung nach Spielnr.)'!$B$2:$C$97,2)","v":{"$error":"#N/A"}}]
[{"$f":"Auslosung5!G35","v":0},{"$f":"Auslosung5!H35","v":{"$error":"#N/A"}},{"$f":"IF(F35+G35>0,IF(H35=\"OK\",IF(G35<F35,G35,100+(G35-F35)),0),0)","v":0},null,null,null,0,{"$f":"IF(OR(F35>=15,G35>=15),\"OK\",\"Fehlende oder falsche EIngabe\")","v":"Fehlende oder falsche EIngabe"}]
[{"$f":"Auslosung5!G36","v":0},{"$f":"Auslosung5!H36","v":{"$error":"#N/A"}},{"$f":"IF(F37+G37>0,IF(H37=\"OK\",IF(F37<G37,F37,100+(F37-G37)),0),0)","v":0},null,null,{"$f":"VLOOKUP(A36,'Meldung (Reihung nach Spielnr.)'!$B$2:$C$97,2)","v":{"$error":"#N/A"}},{"$f":"VLOOKUP(A37,'Meldung (Reihung nach Spielnr.)'!$B$2:$C$97,2)","v":{"$error":"#N/A"}}]
[{"$f":"Auslosung5!G37","v":0},{"$f":"Auslosung5!H37","v":{"$error":"#N/A"}},{"$f":"IF(F37+G37>0,IF(H37=\"OK\",IF(G37<F37,G37,100+(G37-F37)),0),0)","v":0},null,null,null,0,{"$f":"IF(OR(F37>=15,G37>=15),\"OK\",\"Fehlende oder falsche EIngabe\")","v":"Fehlende oder falsche EIngabe"}]
[{"$f":"Auslosung5!G38","v":0},{"$f":"Auslosung5!H38","v":{"$error":"#N/A"}},{"$f":"IF(F39+G39>0,IF(H39=\"OK\",IF(F39<G39,F39,100+(F39-G39)),0),0)","v":0},null,null,{"$f":"VLOOKUP(A38,'Meldung (Reihung nach Spielnr.)'!$B$2:$C$97,2)","v":{"$error":"#N/A"}},{"$f":"VLOOKUP(A39,'Meldung (Reihung nach Spielnr.)'!$B$2:$C$97,2)","v":{"$error":"#N/A"}}]
[{"$f":"Auslosung5!G39","v":0},{"$f":"Auslosung5!H39","v":{"$error":"#N/A"}},{"$f":"IF(F39+G39>0,IF(H39=\"OK\",IF(G39<F39,G39,100+(G39-F39)),0),0)","v":0},null,null,null,0,{"$f":"IF(OR(F39>=15,G39>=15),\"OK\",\"Fehlende oder falsche EIngabe\")","v":"Fehlende oder falsche EIngabe"}]
[{"$f":"Auslosung5!G40","v":0},{"$f":"Auslosung5!H40","v":{"$error":"#N/A"}},{"$f":"IF(F41+G41>0,IF(H41=\"OK\",IF(F41<G41,F41,100+(F41-G41)),0),0)","v":0},null,null,{"$f":"VLOOKUP(A40,'Meldung (Reihung nach Spielnr.)'!$B$2:$C$97,2)","v":{"$error":"#N/A"}},{"$f":"VLOOKUP(A41,'Meldung (Reihung nach Spielnr.)'!$B$2:$C$97,2)","v":{"$error":"#N/A"}}]
[{"$f":"Auslosung5!G41","v":0},{"$f":"Auslosung5!H41","v":{"$error":"#N/A"}},{"$f":"IF(F41+G41>0,IF(H41=\"OK\",IF(G41<F41,G41,100+(G41-F41)),0),0)","v":0},null,null,null,0,{"$f":"IF(OR(F41>=15,G41>=15),\"OK\",\"Fehlende oder falsche EIngabe\")","v":"Fehlende oder falsche EIngabe"}]
[{"$f":"Auslosung5!G42","v":0},{"$f":"Auslosung5!H42","v":{"$error":"#N/A"}},{"$f":"IF(F43+G43>0,IF(H43=\"OK\",IF(F43<G43,F43,100+(F43-G43)),0),0)","v":0},null,null,{"$f":"VLOOKUP(A42,'Meldung (Reihung nach Spielnr.)'!$B$2:$C$97,2)","v":{"$error":"#N/A"}},{"$f":"VLOOKUP(A43,'Meldung (Reihung nach Spielnr.)'!$B$2:$C$97,2)","v":{"$error":"#N/A"}}]
[{"$f":"Auslosung5!G43","v":0},{"$f":"Auslosung5!H43","v":{"$error":"#N/A"}},{"$f":"IF(F43+G43>0,IF(H43=\"OK\",IF(G43<F43,G43,100+(G43-F43)),0),0)","v":0},null,null,null,0,{"$f":"IF(OR(F43>=15,G43>=15),\"OK\",\"Fehlende oder falsche EIngabe\")","v":"Fehlende oder falsche EIngabe"}]
[{"$f":"Auslosung5!G44","v":0},{"$f":"Auslosung5!H44","v":{"$error":"#N/A"}},{"$f":"IF(F45+G45>0,IF(H45=\"OK\",IF(F45<G45,F45,100+(F45-G45)),0),0)","v":0},null,null,{"$f":"VLOOKUP(A44,'Meldung (Reihung nach Spielnr.)'!$B$2:$C$97,2)","v":{"$error":"#N/A"}},{"$f":"VLOOKUP(A45,'Meldung (Reihung nach Spielnr.)'!$B$2:$C$97,2)","v":{"$error":"#N/A"}}]
[{"$f":"Auslosung5!G45","v":0},{"$f":"Auslosung5!H45","v":{"$error":"#N/A"}},{"$f":"IF(F45+G45>0,IF(H45=\"OK\",IF(G45<F45,G45,100+(G45-F45)),0),0)","v":0},null,null,null,0,{"$f":"IF(OR(F45>=15,G45>=15),\"OK\",\"Fehlende oder falsche EIngabe\")","v":"Fehlende oder falsche EIngabe"}]
[{"$f":"Auslosung5!G46","v":0},{"$f":"Auslosung5!H46","v":{"$error":"#N/A"}},{"$f":"IF(F47+G47>0,IF(H47=\"OK\",IF(F47<G47,F47,100+(F47-G47)),0),0)","v":0},null,null,{"$f":"VLOOKUP(A46,'Meldung (Reihung nach Spielnr.)'!$B$2:$C$97,2)","v":{"$error":"#N/A"}},{"$f":"VLOOKUP(A47,'Meldung (Reihung nach Spielnr.)'!$B$2:$C$97,2)","v":{"$error":"#N/A"}}]
[{"$f":"Auslosung5!G47","v":0},{"$f":"Auslosung5!H47","v":{"$error":"#N/A"}},{"$f":"IF(F47+G47>0,IF(H47=\"OK\",IF(G47<F47,G47,100+(G47-F47)),0),0)","v":0},null,null,null,0,{"$f":"IF(OR(F47>=15,G47>=15),\"OK\",\"Fehlende oder falsche EIngabe\")","v":"Fehlende oder falsche EIngabe"}]
[{"$f":"Auslosung5!G48","v":0},{"$f":"Auslosung5!H48","v":{"$error":"#N/A"}},{"$f":"IF(F49+G49>0,IF(H49=\"OK\",IF(F49<G49,F49,100+(F49-G49)),0),0)","v":0},null,null,{"$f":"VLOOKUP(A48,'Meldung (Reihung nach Spielnr.)'!$B$2:$C$97,2)","v":{"$error":"#N/A"}},{"$f":"VLOOKUP(A49,'Meldung (Reihung nach Spielnr.)'!$B$2:$C$97,2)","v":{"$error":"#N/A"}}]
[{"$f":"Auslosung5!G49","v":0},{"$f":"Auslosung5!H49","v":{"$error":"#N/A"}},{"$f":"IF(F49+G49>0,IF(H49=\"OK\",IF(G49<F49,G49,100+(G49-F49)),0),0)","v":0},null,null,null,0,{"$f":"IF(OR(F49>=15,G49>=15),\"OK\",\"Fehlende oder falsche EIngabe\")","v":"Fehlende oder falsche EIngabe"}]
[{"$f":"Auslosung5!G50","v":0},{"$f":"Auslosung5!H50","v":{"$error":"#N/A"}},{"$f":"IF(F51+G51>0,IF(H51=\"OK\",IF(F51<G51,F51,100+(F51-G51)),0),0)","v":0},null,null,{"$f":"VLOOKUP(A50,'Meldung (Reihung nach Spielnr.)'!$B$2:$C$97,2)","v":{"$error":"#N/A"}},{"$f":"VLOOKUP(A51,'Meldung (Reihung nach Spielnr.)'!$B$2:$C$97,2)","v":{"$error":"#N/A"}}]
[{"$f":"Auslosung5!G51","v":0},{"$f":"Auslosung5!H51","v":{"$error":"#N/A"}},{"$f":"IF(F51+G51>0,IF(H51=\"OK\",IF(G51<F51,G51,100+(G51-F51)),0),0)","v":0},null,null,null,0,{"$f":"IF(OR(F51>=15,G51>=15),\"OK\",\"Fehlende oder falsche EIngabe\")","v":"Fehlende oder falsche EIngabe"}]
[{"$f":"Auslosung5!G52","v":0},{"$f":"Auslosung5!H52","v":{"$error":"#N/A"}},{"$f":"IF(F53+G53>0,IF(H53=\"OK\",IF(F53<G53,F53,100+(F53-G53)),0),0)","v":0},null,null,{"$f":"VLOOKUP(A52,'Meldung (Reihung nach Spielnr.)'!$B$2:$C$97,2)","v":{"$error":"#N/A"}},{"$f":"VLOOKUP(A53,'Meldung (Reihung nach Spielnr.)'!$B$2:$C$97,2)","v":{"$error":"#N/A"}}]
[{"$f":"Auslosung5!G53","v":0},{"$f":"Auslosung5!H53","v":{"$error":"#N/A"}},{"$f":"IF(F53+G53>0,IF(H53=\"OK\",IF(G53<F53,G53,100+(G53-F53)),0),0)","v":0},null,null,null,0,{"$f":"IF(OR(F53>=15,G53>=15),\"OK\",\"Fehlende oder falsche EIngabe\")","v":"Fehlende oder falsche EIngabe"}]
[{"$f":"Auslosung5!G54","v":0},{"$f":"Auslosung5!H54","v":{"$error":"#N/A"}},{"$f":"IF(F55+G55>0,IF(H55=\"OK\",IF(F55<G55,F55,100+(F55-G55)),0),0)","v":0},null,null,{"$f":"VLOOKUP(A54,'Meldung (Reihung nach Spielnr.)'!$B$2:$C$97,2)","v":{"$error":"#N/A"}},{"$f":"VLOOKUP(A55,'Meldung (Reihung nach Spielnr.)'!$B$2:$C$97,2)","v":{"$error":"#N/A"}}]
[{"$f":"Auslosung5!G55","v":0},{"$f":"Auslosung5!H55","v":{"$error":"#N/A"}},{"$f":"IF(F55+G55>0,IF(H55=\"OK\",IF(G55<F55,G55,100+(G55-F55)),0),0)","v":0},null,null,null,0,{"$f":"IF(OR(F55>=15,G55>=15),\"OK\",\"Fehlende oder falsche EIngabe\")","v":"Fehlende oder falsche EIngabe"}]
[{"$f":"Auslosung5!G56","v":0},{"$f":"Auslosung5!H56","v":{"$error":"#N/A"}},{"$f":"IF(F57+G57>0,IF(H57=\"OK\",IF(F57<G57,F57,100+(F57-G57)),0),0)","v":0},null,null,{"$f":"VLOOKUP(A56,'Meldung (Reihung nach Spielnr.)'!$B$2:$C$97,2)","v":{"$error":"#N/A"}},{"$f":"VLOOKUP(A57,'Meldung (Reihung nach Spielnr.)'!$B$2:$C$97,2)","v":{"$error":"#N/A"}}]
[{"$f":"Auslosung5!G57","v":0},{"$f":"Auslosung5!H57","v":{"$error":"#N/A"}},{"$f":"IF(F57+G57>0,IF(H57=\"OK\",IF(G57<F57,G57,100+(G57-F57)),0),0)","v":0},null,null,null,0,{"$f":"IF(OR(F57>=15,G57>=15),\"OK\",\"Fehlende oder falsche EIngabe\")","v":"Fehlende oder falsche EIngabe"}]
[{"$f":"Auslosung5!G58","v":0},{"$f":"Auslosung5!H58","v":{"$error":"#N/A"}},{"$f":"IF(F59+G59>0,IF(H59=\"OK\",IF(F59<G59,F59,100+(F59-G59)),0),0)","v":0},null,null,{"$f":"VLOOKUP(A58,'Meldung (Reihung nach Spielnr.)'!$B$2:$C$97,2)","v":{"$error":"#N/A"}},{"$f":"VLOOKUP(A59,'Meldung (Reihung nach Spielnr.)'!$B$2:$C$97,2)","v":{"$error":"#N/A"}}]
[{"$f":"Auslosung5!G59","v":0},{"$f":"Auslosung5!H59","v":{"$error":"#N/A"}},{"$f":"IF(F59+G59>0,IF(H59=\"OK\",IF(G59<F59,G59,100+(G59-F59)),0),0)","v":0},null,null,null,0,{"$f":"IF(OR(F59>=15,G59>=15),\"OK\",\"Fehlende oder falsche EIngabe\")","v":"Fehlende oder falsche EIngabe"}]
[{"$f":"Auslosung5!G60","v":0},{"$f":"Auslosung5!H60","v":{"$error":"#N/A"}},{"$f":"IF(F61+G61>0,IF(H61=\"OK\",IF(F61<G61,F61,100+(F61-G61)),0),0)","v":0},null,null,{"$f":"VLOOKUP(A60,'Meldung (Reihung nach Spielnr.)'!$B$2:$C$97,2)","v":{"$error":"#N/A"}},{"$f":"VLOOKUP(A61,'Meldung (Reihung nach Spielnr.)'!$B$2:$C$97,2)","v":{"$error":"#N/A"}}]
[{"$f":"Auslosung5!G61","v":0},{"$f":"Auslosung5!H61","v":{"$error":"#N/A"}},{"$f":"IF(F61+G61>0,IF(H61=\"OK\",IF(G61<F61,G61,100+(G61-F61)),0),0)","v":0},null,null,null,0,{"$f":"IF(OR(F61>=15,G61>=15),\"OK\",\"Fehlende oder falsche EIngabe\")","v":"Fehlende oder falsche EIngabe"}]
[{"$f":"Auslosung5!G62","v":0},{"$f":"Auslosung5!H62","v":{"$error":"#N/A"}},{"$f":"IF(F63+G63>0,IF(H63=\"OK\",IF(F63<G63,F63,100+(F63-G63)),0),0)","v":0},null,null,{"$f":"VLOOKUP(A62,'Meldung (Reihung nach Spielnr.)'!$B$2:$C$97,2)","v":{"$error":"#N/A"}},{"$f":"VLOOKUP(A63,'Meldung (Reihung nach Spielnr.)'!$B$2:$C$97,2)","v":{"$error":"#N/A"}}]
[{"$f":"Auslosung5!G63","v":0},{"$f":"Auslosung5!H63","v":{"$error":"#N/A"}},{"$f":"IF(F63+G63>0,IF(H63=\"OK\",IF(G63<F63,G63,100+(G63-F63)),0),0)","v":0},null,null,null,0,{"$f":"IF(OR(F63>=15,G63>=15),\"OK\",\"Fehlende oder falsche EIngabe\")","v":"Fehlende oder falsche EIngabe"}]
[{"$f":"Auslosung5!G64","v":0},{"$f":"Auslosung5!H64","v":{"$error":"#N/A"}},{"$f":"IF(F65+G65>0,IF(H65=\"OK\",IF(F65<G65,F65,100+(F65-G65)),0),0)","v":0},null,null,{"$f":"VLOOKUP(A64,'Meldung (Reihung nach Spielnr.)'!$B$2:$C$97,2)","v":{"$error":"#N/A"}},{"$f":"VLOOKUP(A65,'Meldung (Reihung nach Spielnr.)'!$B$2:$C$97,2)","v":{"$error":"#N/A"}}]
[{"$f":"Auslosung5!G65","v":0},{"$f":"Auslosung5!H65","v":{"$error":"#N/A"}},{"$f":"IF(F65+G65>0,IF(H65=\"OK\",IF(G65<F65,G65,100+(G65-F65)),0),0)","v":0},null,null,null,0,{"$f":"IF(OR(F65>=15,G65>=15),\"OK\",\"Fehlende oder falsche EIngabe\")","v":"Fehlende oder falsche EIngabe"}]
[{"$f":"Auslosung5!G66","v":0},{"$f":"Auslosung5!H66","v":{"$error":"#N/A"}},{"$f":"IF(F67+G67>0,IF(H67=\"OK\",IF(F67<G67,F67,100+(F67-G67)),0),0)","v":0},null,null,{"$f":"VLOOKUP(A66,'Meldung (Reihung nach Spielnr.)'!$B$2:$C$97,2)","v":{"$error":"#N/A"}},{"$f":"VLOOKUP(A67,'Meldung (Reihung nach Spielnr.)'!$B$2:$C$97,2)","v":{"$error":"#N/A"}}]
[{"$f":"Auslosung5!G67","v":0},{"$f":"Auslosung5!H67","v":{"$error":"#N/A"}},{"$f":"IF(F67+G67>0,IF(H67=\"OK\",IF(G67<F67,G67,100+(G67-F67)),0),0)","v":0},null,null,null,0,{"$f":"IF(OR(F67>=15,G67>=15),\"OK\",\"Fehlende oder falsche EIngabe\")","v":"Fehlende oder falsche EIngabe"}]
[{"$f":"Auslosung5!G68","v":0},{"$f":"Auslosung5!H68","v":{"$error":"#N/A"}},{"$f":"IF(F69+G69>0,IF(H69=\"OK\",IF(F69<G69,F69,100+(F69-G69)),0),0)","v":0},null,null,{"$f":"VLOOKUP(A68,'Meldung (Reihung nach Spielnr.)'!$B$2:$C$97,2)","v":{"$error":"#N/A"}},{"$f":"VLOOKUP(A69,'Meldung (Reihung nach Spielnr.)'!$B$2:$C$97,2)","v":{"$error":"#N/A"}}]
[{"$f":"Auslosung5!G69","v":0},{"$f":"Auslosung5!H69","v":{"$error":"#N/A"}},{"$f":"IF(F69+G69>0,IF(H69=\"OK\",IF(G69<F69,G69,100+(G69-F69)),0),0)","v":0},null,null,null,0,{"$f":"IF(OR(F69>=15,G69>=15),\"OK\",\"Fehlende oder falsche EIngabe\")","v":"Fehlende oder falsche EIngabe"}]
[{"$f":"Auslosung5!G70","v":0},{"$f":"Auslosung5!H70","v":{"$error":"#N/A"}},{"$f":"IF(F71+G71>0,IF(H71=\"OK\",IF(F71<G71,F71,100+(F71-G71)),0),0)","v":0},null,null,{"$f":"VLOOKUP(A70,'Meldung (Reihung nach Spielnr.)'!$B$2:$C$97,2)","v":{"$error":"#N/A"}},{"$f":"VLOOKUP(A71,'Meldung (Reihung nach Spielnr.)'!$B$2:$C$97,2)","v":{"$error":"#N/A"}}]
[{"$f":"Auslosung5!G71","v":0},{"$f":"Auslosung5!H71","v":{"$error":"#N/A"}},{"$f":"IF(F71+G71>0,IF(H71=\"OK\",IF(G71<F71,G71,100+(G71-F71)),0),0)","v":0},null,null,null,0,{"$f":"IF(OR(F71>=15,G71>=15),\"OK\",\"Fehlende oder falsche EIngabe\")","v":"Fehlende oder falsche EIngabe"}]
[{"$f":"Auslosung5!G72","v":0},{"$f":"Auslosung5!H72","v":{"$error":"#N/A"}},{"$f":"IF(F73+G73>0,IF(H73=\"OK\",IF(F73<G73,F73,100+(F73-G73)),0),0)","v":0},null,null,{"$f":"VLOOKUP(A72,'Meldung (Reihung nach Spielnr.)'!$B$2:$C$97,2)","v":{"$error":"#N/A"}},{"$f":"VLOOKUP(A73,'Meldung (Reihung nach Spielnr.)'!$B$2:$C$97,2)","v":{"$error":"#N/A"}}]
[{"$f":"Auslosung5!G73","v":0},{"$f":"Auslosung5!H73","v":{"$error":"#N/A"}},{"$f":"IF(F73+G73>0,IF(H73=\"OK\",IF(G73<F73,G73,100+(G73-F73)),0),0)","v":0},null,null,null,0,{"$f":"IF(OR(F73>=15,G73>=15),\"OK\",\"Fehlende oder falsche EIngabe\")","v":"Fehlende oder falsche EIngabe"}]
[{"$f":"Auslosung5!G74","v":0},{"$f":"Auslosung5!H74","v":{"$error":"#N/A"}},{"$f":"IF(F75+G75>0,IF(H75=\"OK\",IF(F75<G75,F75,100+(F75-G75)),0),0)","v":0},null,null,{"$f":"VLOOKUP(A74,'Meldung (Reihung nach Spielnr.)'!$B$2:$C$97,2)","v":{"$error":"#N/A"}},{"$f":"VLOOKUP(A75,'Meldung (Reihung nach Spielnr.)'!$B$2:$C$97,2)","v":{"$error":"#N/A"}}]
[{"$f":"Auslosung5!G75","v":0},{"$f":"Auslosung5!H75","v":{"$error":"#N/A"}},{"$f":"IF(F75+G75>0,IF(H75=\"OK\",IF(G75<F75,G75,100+(G75-F75)),0),0)","v":0},null,null,null,0,{"$f":"IF(OR(F75>=15,G75>=15),\"OK\",\"Fehlende oder falsche EIngabe\")","v":"Fehlende oder falsche EIngabe"}]
[{"$f":"Auslosung5!G76","v":0},{"$f":"Auslosung5!H76","v":{"$error":"#N/A"}},{"$f":"IF(F77+G77>0,IF(H77=\"OK\",IF(F77<G77,F77,100+(F77-G77)),0),0)","v":0},null,null,{"$f":"VLOOKUP(A76,'Meldung (Reihung nach Spielnr.)'!$B$2:$C$97,2)","v":{"$error":"#N/A"}},{"$f":"VLOOKUP(A77,'Meldung (Reihung nach Spielnr.)'!$B$2:$C$97,2)","v":{"$error":"#N/A"}}]
[{"$f":"Auslosung5!G77","v":0},{"$f":"Auslosung5!H77","v":{"$error":"#N/A"}},{"$f":"IF(F77+G77>0,IF(H77=\"OK\",IF(G77<F77,G77,100+(G77-F77)),0),0)","v":0},null,null,null,0,{"$f":"IF(OR(F77>=15,G77>=15),\"OK\",\"Fehlende oder falsche EIngabe\")","v":"Fehlende oder falsche EIngabe"}]
[{"$f":"Auslosung5!G78","v":0},{"$f":"Auslosung5!H78","v":{"$error":"#N/A"}},{"$f":"IF(F79+G79>0,IF(H79=\"OK\",IF(F79<G79,F79,100+(F79-G79)),0),0)","v":0},null,null,{"$f":"VLOOKUP(A78,'Meldung (Reihung nach Spielnr.)'!$B$2:$C$97,2)","v":{"$error":"#N/A"}},{"$f":"VLOOKUP(A79,'Meldung (Reihung nach Spielnr.)'!$B$2:$C$97,2)","v":{"$error":"#N/A"}}]
[{"$f":"Auslosung5!G79","v":0},{"$f":"Auslosung5!H79","v":{"$error":"#N/A"}},{"$f":"IF(F79+G79>0,IF(H79=\"OK\",IF(G79<F79,G79,100+(G79-F79)),0),0)","v":0},null,null,null,0,{"$f":"IF(OR(F79>=15,G79>=15),\"OK\",\"Fehlende oder falsche EIngabe\")","v":"Fehlende oder falsche EIngabe"}]
[{"$f":"Auslosung5!G80","v":0},{"$f":"Auslosung5!H80","v":{"$error":"#N/A"}},{"$f":"IF(F81+G81>0,IF(H81=\"OK\",IF(F81<G81,F81,100+(F81-G81)),0),0)","v":0},null,null,{"$f":"VLOOKUP(A80,'Meldung (Reihung nach Spielnr.)'!$B$2:$C$97,2)","v":{"$error":"#N/A"}},{"$f":"VLOOKUP(A81,'Meldung (Reihung nach Spielnr.)'!$B$2:$C$97,2)","v":{"$error":"#N/A"}}]
[{"$f":"Auslosung5!G81","v":0},{"$f":"Auslosung5!H81","v":{"$error":"#N/A"}},{"$f":"IF(F81+G81>0,IF(H81=\"OK\",IF(G81<F81,G81,100+(G81-F81)),0),0)","v":0},null,null,null,0,{"$f":"IF(OR(F81>=15,G81>=15),\"OK\",\"Fehlende oder falsche EIngabe\")","v":"Fehlende oder falsche EIngabe"}]
[{"$f":"Auslosung5!G82","v":0},{"$f":"Auslosung5!H82","v":{"$error":"#N/A"}},{"$f":"IF(F83+G83>0,IF(H83=\"OK\",IF(F83<G83,F83,100+(F83-G83)),0),0)","v":0},null,null,{"$f":"VLOOKUP(A82,'Meldung (Reihung nach Spielnr.)'!$B$2:$C$97,2)","v":{"$error":"#N/A"}},{"$f":"VLOOKUP(A83,'Meldung (Reihung nach Spielnr.)'!$B$2:$C$97,2)","v":{"$error":"#N/A"}}]
[{"$f":"Auslosung5!G83","v":0},{"$f":"Auslosung5!H83","v":{"$error":"#N/A"}},{"$f":"IF(F83+G83>0,IF(H83=\"OK\",IF(G83<F83,G83,100+(G83-F83)),0),0)","v":0},null,null,null,0,{"$f":"IF(OR(F83>=15,G83>=15),\"OK\",\"Fehlende oder falsche EIngabe\")","v":"Fehlende oder falsche EIngabe"}]
[{"$f":"Auslosung5!G84","v":0},{"$f":"Auslosung5!H84","v":{"$error":"#N/A"}},{"$f":"IF(F85+G85>0,IF(H85=\"OK\",IF(F85<G85,F85,100+(F85-G85)),0),0)","v":0},null,null,{"$f":"VLOOKUP(A84,'Meldung (Reihung nach Spielnr.)'!$B$2:$C$97,2)","v":{"$error":"#N/A"}},{"$f":"VLOOKUP(A85,'Meldung (Reihung nach Spielnr.)'!$B$2:$C$97,2)","v":{"$error":"#N/A"}}]
[{"$f":"Auslosung5!G85","v":0},{"$f":"Auslosung5!H85","v":{"$error":"#N/A"}},{"$f":"IF(F85+G85>0,IF(H85=\"OK\",IF(G85<F85,G85,100+(G85-F85)),0),0)","v":0},null,null,null,0,{"$f":"IF(OR(F85>=15,G85>=15),\"OK\",\"Fehlende oder falsche EIngabe\")","v":"Fehlende oder falsche EIngabe"}]
[{"$f":"Auslosung5!G86","v":0},{"$f":"Auslosung5!H86","v":{"$error":"#N/A"}},{"$f":"IF(F87+G87>0,IF(H87=\"OK\",IF(F87<G87,F87,100+(F87-G87)),0),0)","v":0},null,null,{"$f":"VLOOKUP(A86,'Meldung (Reihung nach Spielnr.)'!$B$2:$C$97,2)","v":{"$error":"#N/A"}},{"$f":"VLOOKUP(A87,'Meldung (Reihung nach Spielnr.)'!$B$2:$C$97,2)","v":{"$error":"#N/A"}}]
[{"$f":"Auslosung5!G87","v":0},{"$f":"Auslosung5!H87","v":{"$error":"#N/A"}},{"$f":"IF(F87+G87>0,IF(H87=\"OK\",IF(G87<F87,G87,100+(G87-F87)),0),0)","v":0},null,null,null,0,{"$f":"IF(OR(F87>=15,G87>=15),\"OK\",\"Fehlende oder falsche EIngabe\")","v":"Fehlende oder falsche EIngabe"}]
[{"$f":"Auslosung5!G88","v":0},{"$f":"Auslosung5!H88","v":{"$error":"#N/A"}},{"$f":"IF(F89+G89>0,IF(H89=\"OK\",IF(F89<G89,F89,100+(F89-G89)),0),0)","v":0},null,null,{"$f":"VLOOKUP(A88,'Meldung (Reihung nach Spielnr.)'!$B$2:$C$97,2)","v":{"$error":"#N/A"}},{"$f":"VLOOKUP(A89,'Meldung (Reihung nach Spielnr.)'!$B$2:$C$97,2)","v":{"$error":"#N/A"}}]
[{"$f":"Auslosung5!G89","v":0},{"$f":"Auslosung5!H89","v":{"$error":"#N/A"}},{"$f":"IF(F89+G89>0,IF(H89=\"OK\",IF(G89<F89,G89,100+(G89-F89)),0),0)","v":0},null,null,null,0,{"$f":"IF(OR(F89>=15,G89>=15),\"OK\",\"Fehlende oder falsche EIngabe\")","v":"Fehlende oder falsche EIngabe"}]
[{"$f":"Auslosung5!G90","v":0},{"$f":"Auslosung5!H90","v":{"$error":"#N/A"}},{"$f":"IF(F91+G91>0,IF(H91=\"OK\",IF(F91<G91,F91,100+(F91-G91)),0),0)","v":0},null,null,{"$f":"VLOOKUP(A90,'Meldung (Reihung nach Spielnr.)'!$B$2:$C$97,2)","v":{"$error":"#N/A"}},{"$f":"VLOOKUP(A91,'Meldung (Reihung nach Spielnr.)'!$B$2:$C$97,2)","v":{"$error":"#N/A"}}]
[{"$f":"Auslosung5!G91","v":0},{"$f":"Auslosung5!H91","v":{"$error":"#N/A"}},{"$f":"IF(F91+G91>0,IF(H91=\"OK\",IF(G91<F91,G91,100+(G91-F91)),0),0)","v":0},null,null,null,0,{"$f":"IF(OR(F91>=15,G91>=15),\"OK\",\"Fehlende oder falsche EIngabe\")","v":"Fehlende oder falsche EIngabe"}]
[{"$f":"Auslosung5!G92","v":0},{"$f":"Auslosung5!H92","v":{"$error":"#N/A"}},{"$f":"IF(F93+G93>0,IF(H93=\"OK\",IF(F93<G93,F93,100+(F93-G93)),0),0)","v":0},null,null,{"$f":"VLOOKUP(A92,'Meldung (Reihung nach Spielnr.)'!$B$2:$C$97,2)","v":{"$error":"#N/A"}},{"$f":"VLOOKUP(A93,'Meldung (Reihung nach Spielnr.)'!$B$2:$C$97,2)","v":{"$error":"#N/A"}}]
[{"$f":"Auslosung5!G93","v":0},{"$f":"Auslosung5!H93","v":{"$error":"#N/A"}},{"$f":"IF(F93+G93>0,IF(H93=\"OK\",IF(G93<F93,G93,100+(G93-F93)),0),0)","v":0},null,null,null,0,{"$f":"IF(OR(F93>=15,G93>=15),\"OK\",\"Fehlende oder falsche EIngabe\")","v":"Fehlende oder falsche EIngabe"}]
[{"$f":"Auslosung5!G94","v":0},{"$f":"Auslosung5!H94","v":{"$error":"#N/A"}},{"$f":"IF(F95+G95>0,IF(H95=\"OK\",IF(F95<G95,F95,100+(F95-G95)),0),0)","v":0},null,null,{"$f":"VLOOKUP(A94,'Meldung (Reihung nach Spielnr.)'!$B$2:$C$97,2)","v":{"$error":"#N/A"}},{"$f":"VLOOKUP(A95,'Meldung (Reihung nach Spielnr.)'!$B$2:$C$97,2)","v":{"$error":"#N/A"}}]
[{"$f":"Auslosung5!G95","v":0},{"$f":"Auslosung5!H95","v":{"$error":"#N/A"}},{"$f":"IF(F95+G95>0,IF(H95=\"OK\",IF(G95<F95,G95,100+(G95-F95)),0),0)","v":0},null,null,null,0,{"$f":"IF(OR(F95>=15,G95>=15),\"OK\",\"Fehlende oder falsche EIngabe\")","v":"Fehlende oder falsche EIngabe"}]
[{"$f":"Auslosung5!G96","v":0},{"$f":"Auslosung5!H96","v":{"$error":"#N/A"}},{"$f":"IF(F97+G97>0,IF(H97=\"OK\",IF(F97<G97,F97,100+(F97-G97)),0),0)","v":0},null,null,{"$f":"VLOOKUP(A96,'Meldung (Reihung nach Spielnr.)'!$B$2:$C$97,2)","v":{"$error":"#N/A"}},{"$f":"VLOOKUP(A97,'Meldung (Reihung nach Spielnr.)'!$B$2:$C$97,2)","v":{"$error":"#N/A"}}]
[{"$f":"Auslosung5!G97","v":0},{"$f":"Auslosung5!H97","v":{"$error":"#N/A"}},{"$f":"IF(F97+G97>0,IF(H97=\"OK\",IF(G97<F97,G97,100+(G97-F97)),0),0)","v":0},null,null,null,null,{"$f":"IF(OR(F97>=15,G97>=15),\"OK\",\"Fehlende oder falsche EIngabe\")","v":"Fehlende oder falsche EIngabe"}]

{"sheet":"Auslosung6","index":12,"n_rows":97,"n_cols":8,"rows_kept":97,"cut":false,"hidden":false,"merged":[]}
[13,"Geben Sie in die grüne Zelle, die Anzahl der Mitspieler ein",null,null,"Zahl","TISCH","Spieler Nr.","Name"]
[12,{"$f":"Auslosung1!B2","v":20},null,null,1,1,{"$f":"A1","v":13},{"$f":"VLOOKUP(A1,'Meldung (Reihung nach Spielnr.)'!$B$2:$C$97,2)","v":"Peter Auer u Stefan Sarg/Axams"}]
[16,{"$f":"'Meldung (Reihung nach Spielnr.)'!M1","v":20},null,null,2,1,{"$f":"A2","v":12},{"$f":"VLOOKUP(A2,'Meldung (Reihung nach Spielnr.)'!$B$2:$C$97,2)","v":"Heinrich Ebner u Erich Peer/Südtirol"}]
[2,null,null,null,3,2,16,{"$f":"VLOOKUP(A3,'Meldung (Reihung nach Spielnr.)'!$B$2:$C$97,2)","v":"Hermann Lechner u Andreas Oberacher/Kematen"}]
[4,null,null,null,4,2,2,{"$f":"VLOOKUP(A4,'Meldung (Reihung nach Spielnr.)'!$B$2:$C$97,2)","v":"Annette u Veronika/Telfs"}]
[5,null,null,null,5,3,4,{"$f":"VLOOKUP(A5,'Meldung (Reihung nach Spielnr.)'!$B$2:$C$97,2)","v":"Andi Krajic u Peter Doblander/Tarrenz"}]
[7,null,null,null,6,3,5,{"$f":"VLOOKUP(A6,'Meldung (Reihung nach Spielnr.)'!$B$2:$C$97,2)","v":"Gerhard Schuler u Meinhard Eiter/Imst"}]
[18,null,null,null,7,4,7,{"$f":"VLOOKUP(A7,'Meldung (Reihung nach Spielnr.)'!$B$2:$C$97,2)","v":"Thomas Heltschl u Fredl Mungenast/Imst"}]
[10,null,null,null,8,4,18,{"$f":"VLOOKUP(A8,'Meldung (Reihung nach Spielnr.)'!$B$2:$C$97,2)","v":"Josef Eisenbeutl u Herbert Gamper/Imst"}]
[1,null,null,null,9,5,10,{"$f":"VLOOKUP(A9,'Meldung (Reihung nach Spielnr.)'!$B$2:$C$97,2)","v":"Franz Pellegrini u Hans Matha/Südtirol"}]
[8,null,null,null,10,5,1,{"$f":"VLOOKUP(A10,'Meldung (Reihung nach Spielnr.)'!$B$2:$C$97,2)","v":"Edi u Gerald/Telfs"}]
[17,null,null,null,11,6,8,{"$f":"VLOOKUP(A11,'Meldung (Reihung nach Spielnr.)'!$B$2:$C$97,2)","v":"Herbert Lechleitner u  Stefan Krabichler/Imst"}]
[14,null,null,null,12,6,17,{"$f":"VLOOKUP(A12,'Meldung (Reihung nach Spielnr.)'!$B$2:$C$97,2)","v":"Karin Logar u Rudolf Häusler/Kematen"}]
[11,null,null,null,13,7,14,{"$f":"VLOOKUP(A13,'Meldung (Reihung nach Spielnr.)'!$B$2:$C$97,2)","v":"Hansjörg Hell u Franz Braunegger/Axams"}]
[3,null,null,null,14,7,11,{"$f":"VLOOKUP(A14,'Meldung (Reihung nach Spielnr.)'!$B$2:$C$97,2)","v":"Heini Gruber u Gottfried Geier/Südtirol"}]
[19,null,null,null,15,8,3,{"$f":"VLOOKUP(A15,'Meldung (Reihung nach Spielnr.)'!$B$2:$C$97,2)","v":"Hubert Auer u Daniela Nöbauer/Telfs"}]
[20,null,null,null,16,8,19,{"$f":"VLOOKUP(A16,'Meldung (Reihung nach Spielnr.)'!$B$2:$C$97,2)","v":"Kurt Zebisch | Mr. Bean"}]
[15,null,null,null,17,9,20,{"$f":"VLOOKUP(A17,'Meldung (Reihung nach Spielnr.)'!$B$2:$C$97,2)","v":"Krissmer Reinhard | Fringer Fred"}]
[6,null,null,null,18,9,15,{"$f":"VLOOKUP(A18,'Meldung (Reihung nach Spielnr.)'!$B$2:$C$97,2)","v":"Bernhard Meischberger u Martin Staggl/Kematen"}]
[9,null,null,null,19,10,6,{"$f":"VLOOKUP(A19,'Meldung (Reihung nach Spielnr.)'!$B$2:$C$97,2)","v":"Hans Perktold u Horst Friedl/Imst"}]
[null,null,null,null,20,10,9,{"$f":"VLOOKUP(A20,'Meldung (Reihung nach Spielnr.)'!$B$2:$C$97,2)","v":"Rudi Kastner u Peter Tschenett/Imst"}]
[null,null,null,null,21,11,0,{"$f":"VLOOKUP(A21,'Meldung (Reihung nach Spielnr.)'!$B$2:$C$97,2)","v":{"$error":"#N/A"}}]
[null,null,null,null,22,11,0,{"$f":"VLOOKUP(A22,'Meldung (Reihung nach Spielnr.)'!$B$2:$C$97,2)","v":{"$error":"#N/A"}}]
[null,null,null,null,23,12,0,{"$f":"VLOOKUP(A23,'Meldung (Reihung nach Spielnr.)'!$B$2:$C$97,2)","v":{"$error":"#N/A"}}]
[null,null,null,null,24,12,0,{"$f":"VLOOKUP(A24,'Meldung (Reihung nach Spielnr.)'!$B$2:$C$97,2)","v":{"$error":"#N/A"}}]
[null,null,null,null,25,13,0,{"$f":"VLOOKUP(A25,'Meldung (Reihung nach Spielnr.)'!$B$2:$C$97,2)","v":{"$error":"#N/A"}}]
[null,null,null,null,26,13,0,{"$f":"VLOOKUP(A26,'Meldung (Reihung nach Spielnr.)'!$B$2:$C$97,2)","v":{"$error":"#N/A"}}]
[null,null,null,null,27,14,0,{"$f":"VLOOKUP(A27,'Meldung (Reihung nach Spielnr.)'!$B$2:$C$97,2)","v":{"$error":"#N/A"}}]
[null,null,null,null,28,14,0,{"$f":"VLOOKUP(A28,'Meldung (Reihung nach Spielnr.)'!$B$2:$C$97,2)","v":{"$error":"#N/A"}}]
[null,null,null,null,29,15,0,{"$f":"VLOOKUP(A29,'Meldung (Reihung nach Spielnr.)'!$B$2:$C$97,2)","v":{"$error":"#N/A"}}]
[null,null,null,null,30,15,0,{"$f":"VLOOKUP(A30,'Meldung (Reihung nach Spielnr.)'!$B$2:$C$97,2)","v":{"$error":"#N/A"}}]
[null,null,null,null,31,16,0,{"$f":"VLOOKUP(A31,'Meldung (Reihung nach Spielnr.)'!$B$2:$C$97,2)","v":{"$error":"#N/A"}}]
[null,null,null,null,32,16,0,{"$f":"VLOOKUP(A32,'Meldung (Reihung nach Spielnr.)'!$B$2:$C$97,2)","v":{"$error":"#N/A"}}]
[null,null,null,null,33,17,0,{"$f":"VLOOKUP(A33,'Meldung (Reihung nach Spielnr.)'!$B$2:$C$97,2)","v":{"$error":"#N/A"}}]
[null,null,null,null,34,17,0,{"$f":"VLOOKUP(A34,'Meldung (Reihung nach Spielnr.)'!$B$2:$C$97,2)","v":{"$error":"#N/A"}}]
[null,null,null,null,35,18,0,{"$f":"VLOOKUP(A35,'Meldung (Reihung nach Spielnr.)'!$B$2:$C$97,2)","v":{"$error":"#N/A"}}]
[null,null,null,null,36,18,0,{"$f":"VLOOKUP(A36,'Meldung (Reihung nach Spielnr.)'!$B$2:$C$97,2)","v":{"$error":"#N/A"}}]
[null,null,null,null,37,19,0,{"$f":"VLOOKUP(A37,'Meldung (Reihung nach Spielnr.)'!$B$2:$C$97,2)","v":{"$error":"#N/A"}}]
[null,null,null,null,38,19,0,{"$f":"VLOOKUP(A38,'Meldung (Reihung nach Spielnr.)'!$B$2:$C$97,2)","v":{"$error":"#N/A"}}]
[null,null,null,null,39,20,0,{"$f":"VLOOKUP(A39,'Meldung (Reihung nach Spielnr.)'!$B$2:$C$97,2)","v":{"$error":"#N/A"}}]
[null,null,null,null,40,20,0,{"$f":"VLOOKUP(A40,'Meldung (Reihung nach Spielnr.)'!$B$2:$C$97,2)","v":{"$error":"#N/A"}}]
[null,null,null,null,41,21,0,{"$f":"VLOOKUP(A41,'Meldung (Reihung nach Spielnr.)'!$B$2:$C$97,2)","v":{"$error":"#N/A"}}]
[null,null,null,null,42,21,0,{"$f":"VLOOKUP(A42,'Meldung (Reihung nach Spielnr.)'!$B$2:$C$97,2)","v":{"$error":"#N/A"}}]
[null,null,null,null,43,22,0,{"$f":"VLOOKUP(A43,'Meldung (Reihung nach Spielnr.)'!$B$2:$C$97,2)","v":{"$error":"#N/A"}}]
[null,null,null,null,44,22,0,{"$f":"VLOOKUP(A44,'Meldung (Reihung nach Spielnr.)'!$B$2:$C$97,2)","v":{"$error":"#N/A"}}]
[null,null,null,null,45,23,0,{"$f":"VLOOKUP(A45,'Meldung (Reihung nach Spielnr.)'!$B$2:$C$97,2)","v":{"$error":"#N/A"}}]
[null,null,null,null,46,23,0,{"$f":"VLOOKUP(A46,'Meldung (Reihung nach Spielnr.)'!$B$2:$C$97,2)","v":{"$error":"#N/A"}}]
[null,null,null,null,47,24,0,{"$f":"VLOOKUP(A47,'Meldung (Reihung nach Spielnr.)'!$B$2:$C$97,2)","v":{"$error":"#N/A"}}]
[null,null,null,null,48,24,0,{"$f":"VLOOKUP(A48,'Meldung (Reihung nach Spielnr.)'!$B$2:$C$97,2)","v":{"$error":"#N/A"}}]
[null,null,null,null,49,25,0,{"$f":"VLOOKUP(A49,'Meldung (Reihung nach Spielnr.)'!$B$2:$C$97,2)","v":{"$error":"#N/A"}}]
[null,null,null,null,50,25,0,{"$f":"VLOOKUP(A50,'Meldung (Reihung nach Spielnr.)'!$B$2:$C$97,2)","v":{"$error":"#N/A"}}]
[null,null,null,null,51,26,0,{"$f":"VLOOKUP(A51,'Meldung (Reihung nach Spielnr.)'!$B$2:$C$97,2)","v":{"$error":"#N/A"}}]
[null,null,null,null,52,26,0,{"$f":"VLOOKUP(A52,'Meldung (Reihung nach Spielnr.)'!$B$2:$C$97,2)","v":{"$error":"#N/A"}}]
[null,null,null,null,53,27,0,{"$f":"VLOOKUP(A53,'Meldung (Reihung nach Spielnr.)'!$B$2:$C$97,2)","v":{"$error":"#N/A"}}]
[null,null,null,null,54,27,0,{"$f":"VLOOKUP(A54,'Meldung (Reihung nach Spielnr.)'!$B$2:$C$97,2)","v":{"$error":"#N/A"}}]
[null,null,null,null,55,28,0,{"$f":"VLOOKUP(A55,'Meldung (Reihung nach Spielnr.)'!$B$2:$C$97,2)","v":{"$error":"#N/A"}}]
[null,null,null,null,56,28,0,{"$f":"VLOOKUP(A56,'Meldung (Reihung nach Spielnr.)'!$B$2:$C$97,2)","v":{"$error":"#N/A"}}]
[null,null,null,null,57,29,0,{"$f":"VLOOKUP(A57,'Meldung (Reihung nach Spielnr.)'!$B$2:$C$97,2)","v":{"$error":"#N/A"}}]
[null,null,null,null,58,29,0,{"$f":"VLOOKUP(A58,'Meldung (Reihung nach Spielnr.)'!$B$2:$C$97,2)","v":{"$error":"#N/A"}}]
[null,null,null,null,59,30,0,{"$f":"VLOOKUP(A59,'Meldung (Reihung nach Spielnr.)'!$B$2:$C$97,2)","v":{"$error":"#N/A"}}]
[null,null,null,null,60,30,0,{"$f":"VLOOKUP(A60,'Meldung (Reihung nach Spielnr.)'!$B$2:$C$97,2)","v":{"$error":"#N/A"}}]
[null,null,null,null,61,31,0,{"$f":"VLOOKUP(A61,'Meldung (Reihung nach Spielnr.)'!$B$2:$C$97,2)","v":{"$error":"#N/A"}}]
[null,null,null,null,62,31,0,{"$f":"VLOOKUP(A62,'Meldung (Reihung nach Spielnr.)'!$B$2:$C$97,2)","v":{"$error":"#N/A"}}]
[null,null,null,null,63,32,0,{"$f":"VLOOKUP(A63,'Meldung (Reihung nach Spielnr.)'!$B$2:$C$97,2)","v":{"$error":"#N/A"}}]
[null,null,null,null,64,32,0,{"$f":"VLOOKUP(A64,'Meldung (Reihung nach Spielnr.)'!$B$2:$C$97,2)","v":{"$error":"#N/A"}}]
[null,null,null,null,65,33,0,{"$f":"VLOOKUP(A65,'Meldung (Reihung nach Spielnr.)'!$B$2:$C$97,2)","v":{"$error":"#N/A"}}]
[null,null,null,null,66,33,{"$f":"A66","v":0},{"$f":"VLOOKUP(A66,'Meldung (Reihung nach Spielnr.)'!$B$2:$C$97,2)","v":{"$error":"#N/A"}}]
[null,null,null,null,67,17,0,{"$f":"VLOOKUP(A67,'Meldung (Reihung nach Spielnr.)'!$B$2:$C$97,2)","v":{"$error":"#N/A"}}]
[null,null,null,null,68,34,0,{"$f":"VLOOKUP(A68,'Meldung (Reihung nach Spielnr.)'!$B$2:$C$97,2)","v":{"$error":"#N/A"}}]
[null,null,null,null,69,34,0,{"$f":"VLOOKUP(A69,'Meldung (Reihung nach Spielnr.)'!$B$2:$C$97,2)","v":{"$error":"#N/A"}}]
[null,null,null,null,70,35,0,{"$f":"VLOOKUP(A70,'Meldung (Reihung nach Spielnr.)'!$B$2:$C$97,2)","v":{"$error":"#N/A"}}]
[null,null,null,null,71,35,0,{"$f":"VLOOKUP(A71,'Meldung (Reihung nach Spielnr.)'!$B$2:$C$97,2)","v":{"$error":"#N/A"}}]
[null,null,null,null,72,36,0,{"$f":"VLOOKUP(A72,'Meldung (Reihung nach Spielnr.)'!$B$2:$C$97,2)","v":{"$error":"#N/A"}}]
[null,null,null,null,73,36,0,{"$f":"VLOOKUP(A73,'Meldung (Reihung nach Spielnr.)'!$B$2:$C$97,2)","v":{"$error":"#N/A"}}]
[null,null,null,null,74,36,0,{"$f":"VLOOKUP(A74,'Meldung (Reihung nach Spielnr.)'!$B$2:$C$97,2)","v":{"$error":"#N/A"}}]
[null,null,null,null,75,37,0,{"$f":"VLOOKUP(A75,'Meldung (Reihung nach Spielnr.)'!$B$2:$C$97,2)","v":{"$error":"#N/A"}}]
[null,null,null,null,76,37,0,{"$f":"VLOOKUP(A76,'Meldung (Reihung nach Spielnr.)'!$B$2:$C$97,2)","v":{"$error":"#N/A"}}]
[null,null,null,null,77,38,0,{"$f":"VLOOKUP(A77,'Meldung (Reihung nach Spielnr.)'!$B$2:$C$97,2)","v":{"$error":"#N/A"}}]
[null,null,null,null,78,38,0,{"$f":"VLOOKUP(A78,'Meldung (Reihung nach Spielnr.)'!$B$2:$C$97,2)","v":{"$error":"#N/A"}}]
[null,null,null,null,79,39,0,{"$f":"VLOOKUP(A79,'Meldung (Reihung nach Spielnr.)'!$B$2:$C$97,2)","v":{"$error":"#N/A"}}]
[null,null,null,null,80,39,0,{"$f":"VLOOKUP(A80,'Meldung (Reihung nach Spielnr.)'!$B$2:$C$97,2)","v":{"$error":"#N/A"}}]
[null,null,null,null,81,40,0,{"$f":"VLOOKUP(A81,'Meldung (Reihung nach Spielnr.)'!$B$2:$C$97,2)","v":{"$error":"#N/A"}}]
[null,null,null,null,82,40,0,{"$f":"VLOOKUP(A82,'Meldung (Reihung nach Spielnr.)'!$B$2:$C$97,2)","v":{"$error":"#N/A"}}]
[null,null,null,null,83,41,0,{"$f":"VLOOKUP(A83,'Meldung (Reihung nach Spielnr.)'!$B$2:$C$97,2)","v":{"$error":"#N/A"}}]
[null,null,null,null,84,41,0,{"$f":"VLOOKUP(A84,'Meldung (Reihung nach Spielnr.)'!$B$2:$C$97,2)","v":{"$error":"#N/A"}}]
[null,null,null,null,85,42,0,{"$f":"VLOOKUP(A85,'Meldung (Reihung nach Spielnr.)'!$B$2:$C$97,2)","v":{"$error":"#N/A"}}]
[null,null,null,null,86,42,0,{"$f":"VLOOKUP(A86,'Meldung (Reihung nach Spielnr.)'!$B$2:$C$97,2)","v":{"$error":"#N/A"}}]
[null,null,null,null,87,43,0,{"$f":"VLOOKUP(A87,'Meldung (Reihung nach Spielnr.)'!$B$2:$C$97,2)","v":{"$error":"#N/A"}}]
[null,null,null,null,88,4,0,{"$f":"VLOOKUP(A88,'Meldung (Reihung nach Spielnr.)'!$B$2:$C$97,2)","v":{"$error":"#N/A"}}]
[null,null,null,null,89,44,0,{"$f":"VLOOKUP(A89,'Meldung (Reihung nach Spielnr.)'!$B$2:$C$97,2)","v":{"$error":"#N/A"}}]
[null,null,null,null,90,44,0,{"$f":"VLOOKUP(A90,'Meldung (Reihung nach Spielnr.)'!$B$2:$C$97,2)","v":{"$error":"#N/A"}}]
[null,null,null,null,91,45,0,{"$f":"VLOOKUP(A91,'Meldung (Reihung nach Spielnr.)'!$B$2:$C$97,2)","v":{"$error":"#N/A"}}]
[null,null,null,null,92,45,0,{"$f":"VLOOKUP(A92,'Meldung (Reihung nach Spielnr.)'!$B$2:$C$97,2)","v":{"$error":"#N/A"}}]
[null,null,null,null,93,46,0,{"$f":"VLOOKUP(A93,'Meldung (Reihung nach Spielnr.)'!$B$2:$C$97,2)","v":{"$error":"#N/A"}}]
[null,null,null,null,94,46,0,{"$f":"VLOOKUP(A94,'Meldung (Reihung nach Spielnr.)'!$B$2:$C$97,2)","v":{"$error":"#N/A"}}]
[null,null,null,null,95,47,0,{"$f":"VLOOKUP(A95,'Meldung (Reihung nach Spielnr.)'!$B$2:$C$97,2)","v":{"$error":"#N/A"}}]
[null,null,null,null,96,47,0,{"$f":"VLOOKUP(A96,'Meldung (Reihung nach Spielnr.)'!$B$2:$C$97,2)","v":{"$error":"#N/A"}}]

{"sheet":"Runde 6","index":13,"n_rows":97,"n_cols":8,"rows_kept":97,"cut":false,"hidden":false,"merged":[[0,3,0,4]]}
["Spielnr.","Name","Runde 6",null,null,"Punkte","Punkte",15]
[{"$f":"Auslosung6!G2","v":13},{"$f":"Auslosung6!H2","v":"Peter Auer u Stefan Sarg/Axams"},{"$f":"IF(F3+G3>0,IF(H3=\"OK\",IF(F3<G3,F3,100+(F3-G3)),0),0)","v":0},null,null,{"$f":"VLOOKUP(A2,'Meldung (Reihung nach Spielnr.)'!$B$2:$C$97,2)","v":"Peter Auer u Stefan Sarg/Axams"},{"$f":"VLOOKUP(A3,'Meldung (Reihung nach Spielnr.)'!$B$2:$C$97,2)","v":"Heinrich Ebner u Erich Peer/Südtirol"}]
[{"$f":"Auslosung6!G3","v":12},{"$f":"Auslosung6!H3","v":"Heinrich Ebner u Erich Peer/Südtirol"},{"$f":"IF(F3+G3>0,IF(H3=\"OK\",IF(G3<F3,G3,100+(G3-F3)),0),0)","v":0},null,null,0,null,{"$f":"IF(OR(F3>=15,G3>=15),\"OK\",\"Fehlende oder falsche EIngabe\")","v":"Fehlende oder falsche EIngabe"}]
[{"$f":"Auslosung6!G4","v":16},{"$f":"Auslosung6!H4","v":"Hermann Lechner u Andreas Oberacher/Kematen"},{"$f":"IF(F5+G5>0,IF(H5=\"OK\",IF(F5<G5,F5,100+(F5-G5)),0),0)","v":0},null,null,{"$f":"VLOOKUP(A4,'Meldung (Reihung nach Spielnr.)'!$B$2:$C$97,2)","v":"Hermann Lechner u Andreas Oberacher/Kematen"},{"$f":"VLOOKUP(A5,'Meldung (Reihung nach Spielnr.)'!$B$2:$C$97,2)","v":"Annette u Veronika/Telfs"}]
[{"$f":"Auslosung6!G5","v":2},{"$f":"Auslosung6!H5","v":"Annette u Veronika/Telfs"},{"$f":"IF(F5+G5>0,IF(H5=\"OK\",IF(G5<F5,G5,100+(G5-F5)),0),0)","v":0},null,null,null,0,{"$f":"IF(OR(F5>=15,G5>=15),\"OK\",\"Fehlende oder falsche EIngabe\")","v":"Fehlende oder falsche EIngabe"}]
[{"$f":"Auslosung6!G6","v":4},{"$f":"Auslosung6!H6","v":"Andi Krajic u Peter Doblander/Tarrenz"},{"$f":"IF(F7+G7>0,IF(H7=\"OK\",IF(F7<G7,F7,100+(F7-G7)),0),0)","v":0},null,null,{"$f":"VLOOKUP(A6,'Meldung (Reihung nach Spielnr.)'!$B$2:$C$97,2)","v":"Andi Krajic u Peter Doblander/Tarrenz"},{"$f":"VLOOKUP(A7,'Meldung (Reihung nach Spielnr.)'!$B$2:$C$97,2)","v":"Gerhard Schuler u Meinhard Eiter/Imst"}]
[{"$f":"Auslosung6!G7","v":5},{"$f":"Auslosung6!H7","v":"Gerhard Schuler u Meinhard Eiter/Imst"},{"$f":"IF(F7+G7>0,IF(H7=\"OK\",IF(G7<F7,G7,100+(G7-F7)),0),0)","v":0},null,null,null,0,{"$f":"IF(OR(F7>=15,G7>=15),\"OK\",\"Fehlende oder falsche EIngabe\")","v":"Fehlende oder falsche EIngabe"}]
[{"$f":"Auslosung6!G8","v":7},{"$f":"Auslosung6!H8","v":"Thomas Heltschl u Fredl Mungenast/Imst"},{"$f":"IF(F9+G9>0,IF(H9=\"OK\",IF(F9<G9,F9,100+(F9-G9)),0),0)","v":0},null,null,{"$f":"VLOOKUP(A8,'Meldung (Reihung nach Spielnr.)'!$B$2:$C$97,2)","v":"Thomas Heltschl u Fredl Mungenast/Imst"},{"$f":"VLOOKUP(A9,'Meldung (Reihung nach Spielnr.)'!$B$2:$C$97,2)","v":"Josef Eisenbeutl u Herbert Gamper/Imst"}]
[{"$f":"Auslosung6!G9","v":18},{"$f":"Auslosung6!H9","v":"Josef Eisenbeutl u Herbert Gamper/Imst"},{"$f":"IF(F9+G9>0,IF(H9=\"OK\",IF(G9<F9,G9,100+(G9-F9)),0),0)","v":0},null,null,null,null,{"$f":"IF(OR(F9>=15,G9>=15),\"OK\",\"Fehlende oder falsche EIngabe\")","v":"Fehlende oder falsche EIngabe"}]
[{"$f":"Auslosung6!G10","v":10},{"$f":"Auslosung6!H10","v":"Franz Pellegrini u Hans Matha/Südtirol"},{"$f":"IF(F11+G11>0,IF(H11=\"OK\",IF(F11<G11,F11,100+(F11-G11)),0),0)","v":0},null,null,{"$f":"VLOOKUP(A10,'Meldung (Reihung nach Spielnr.)'!$B$2:$C$97,2)","v":"Franz Pellegrini u Hans Matha/Südtirol"},{"$f":"VLOOKUP(A11,'Meldung (Reihung nach Spielnr.)'!$B$2:$C$97,2)","v":"Edi u Gerald/Telfs"}]
[{"$f":"Auslosung6!G11","v":1},{"$f":"Auslosung6!H11","v":"Edi u Gerald/Telfs"},{"$f":"IF(F11+G11>0,IF(H11=\"OK\",IF(G11<F11,G11,100+(G11-F11)),0),0)","v":0},null,null,null,0,{"$f":"IF(OR(F11>=15,G11>=15),\"OK\",\"Fehlende oder falsche EIngabe\")","v":"Fehlende oder falsche EIngabe"}]
[{"$f":"Auslosung6!G12","v":8},{"$f":"Auslosung6!H12","v":"Herbert Lechleitner u  Stefan Krabichler/Imst"},{"$f":"IF(F13+G13>0,IF(H13=\"OK\",IF(F13<G13,F13,100+(F13-G13)),0),0)","v":0},null,null,{"$f":"VLOOKUP(A12,'Meldung (Reihung nach Spielnr.)'!$B$2:$C$97,2)","v":"Herbert Lechleitner u  Stefan Krabichler/Imst"},{"$f":"VLOOKUP(A13,'Meldung (Reihung nach Spielnr.)'!$B$2:$C$97,2)","v":"Karin Logar u Rudolf Häusler/Kematen"}]
[{"$f":"Auslosung6!G13","v":17},{"$f":"Auslosung6!H13","v":"Karin Logar u Rudolf Häusler/Kematen"},{"$f":"IF(F13+G13>0,IF(H13=\"OK\",IF(G13<F13,G13,100+(G13-F13)),0),0)","v":0},null,null,null,0,{"$f":"IF(OR(F13>=15,G13>=15),\"OK\",\"Fehlende oder falsche EIngabe\")","v":"Fehlende oder falsche EIngabe"}]
[{"$f":"Auslosung6!G14","v":14},{"$f":"Auslosung6!H14","v":"Hansjörg Hell u Franz Braunegger/Axams"},{"$f":"IF(F15+G15>0,IF(H15=\"OK\",IF(F15<G15,F15,100+(F15-G15)),0),0)","v":0},null,null,{"$f":"VLOOKUP(A14,'Meldung (Reihung nach Spielnr.)'!$B$2:$C$97,2)","v":"Hansjörg Hell u Franz Braunegger/Axams"},{"$f":"VLOOKUP(A15,'Meldung (Reihung nach Spielnr.)'!$B$2:$C$97,2)","v":"Heini Gruber u Gottfried Geier/Südtirol"}]
[{"$f":"Auslosung6!G15","v":11},{"$f":"Auslosung6!H15","v":"Heini Gruber u Gottfried Geier/Südtirol"},{"$f":"IF(F15+G15>0,IF(H15=\"OK\",IF(G15<F15,G15,100+(G15-F15)),0),0)","v":0},null,null,null,0,{"$f":"IF(OR(F15>=15,G15>=15),\"OK\",\"Fehlende oder falsche EIngabe\")","v":"Fehlende oder falsche EIngabe"}]
[{"$f":"Auslosung6!G16","v":3},{"$f":"Auslosung6!H16","v":"Hubert Auer u Daniela Nöbauer/Telfs"},{"$f":"IF(F17+G17>0,IF(H17=\"OK\",IF(F17<G17,F17,100+(F17-G17)),0),0)","v":0},null,null,{"$f":"VLOOKUP(A16,'Meldung (Reihung nach Spielnr.)'!$B$2:$C$97,2)","v":"Hubert Auer u Daniela Nöbauer/Telfs"},{"$f":"VLOOKUP(A17,'Meldung (Reihung nach Spielnr.)'!$B$2:$C$97,2)","v":"Kurt Zebisch | Mr. Bean"}]
[{"$f":"Auslosung6!G17","v":19},{"$f":"Auslosung6!H17","v":"Kurt Zebisch | Mr. Bean"},{"$f":"IF(F17+G17>0,IF(H17=\"OK\",IF(G17<F17,G17,100+(G17-F17)),0),0)","v":0},null,null,null,null,{"$f":"IF(OR(F17>=15,G17>=15),\"OK\",\"Fehlende oder falsche EIngabe\")","v":"Fehlende oder falsche EIngabe"}]
[{"$f":"Auslosung6!G18","v":20},{"$f":"Auslosung6!H18","v":"Krissmer Reinhard | Fringer Fred"},{"$f":"IF(F19+G19>0,IF(H19=\"OK\",IF(F19<G19,F19,100+(F19-G19)),0),0)","v":0},null,null,{"$f":"VLOOKUP(A18,'Meldung (Reihung nach Spielnr.)'!$B$2:$C$97,2)","v":"Krissmer Reinhard | Fringer Fred"},{"$f":"VLOOKUP(A19,'Meldung (Reihung nach Spielnr.)'!$B$2:$C$97,2)","v":"Bernhard Meischberger u Martin Staggl/Kematen"}]
[{"$f":"Auslosung6!G19","v":15},{"$f":"Auslosung6!H19","v":"Bernhard Meischberger u Martin Staggl/Kematen"},{"$f":"IF(F19+G19>0,IF(H19=\"OK\",IF(G19<F19,G19,100+(G19-F19)),0),0)","v":0},null,null,null,0,{"$f":"IF(OR(F19>=15,G19>=15),\"OK\",\"Fehlende oder falsche EIngabe\")","v":"Fehlende oder falsche EIngabe"}]
[{"$f":"Auslosung6!G20","v":6},{"$f":"Auslosung6!H20","v":"Hans Perktold u Horst Friedl/Imst"},{"$f":"IF(F21+G21>0,IF(H21=\"OK\",IF(F21<G21,F21,100+(F21-G21)),0),0)","v":0},null,null,{"$f":"VLOOKUP(A20,'Meldung (Reihung nach Spielnr.)'!$B$2:$C$97,2)","v":"Hans Perktold u Horst Friedl/Imst"},{"$f":"VLOOKUP(A21,'Meldung (Reihung nach Spielnr.)'!$B$2:$C$97,2)","v":"Rudi Kastner u Peter Tschenett/Imst"}]
[{"$f":"Auslosung6!G21","v":9},{"$f":"Auslosung6!H21","v":"Rudi Kastner u Peter Tschenett/Imst"},{"$f":"IF(F21+G21>0,IF(H21=\"OK\",IF(G21<F21,G21,100+(G21-F21)),0),0)","v":0},null,null,null,0,{"$f":"IF(OR(F21>=15,G21>=15),\"OK\",\"Fehlende oder falsche EIngabe\")","v":"Fehlende oder falsche EIngabe"}]
[{"$f":"Auslosung6!G22","v":0},{"$f":"Auslosung6!H22","v":{"$error":"#N/A"}},{"$f":"IF(F23+G23>0,IF(H23=\"OK\",IF(F23<G23,F23,100+(F23-G23)),0),0)","v":0},null,null,{"$f":"VLOOKUP(A22,'Meldung (Reihung nach Spielnr.)'!$B$2:$C$97,2)","v":{"$error":"#N/A"}},{"$f":"VLOOKUP(A23,'Meldung (Reihung nach Spielnr.)'!$B$2:$C$97,2)","v":{"$error":"#N/A"}}]
[{"$f":"Auslosung6!G23","v":0},{"$f":"Auslosung6!H23","v":{"$error":"#N/A"}},{"$f":"IF(F23+G23>0,IF(H23=\"OK\",IF(G23<F23,G23,100+(G23-F23)),0),0)","v":0},null,null,null,0,{"$f":"IF(OR(F23>=15,G23>=15),\"OK\",\"Fehlende oder falsche EIngabe\")","v":"Fehlende oder falsche EIngabe"}]
[{"$f":"Auslosung6!G24","v":0},{"$f":"Auslosung6!H24","v":{"$error":"#N/A"}},{"$f":"IF(F25+G25>0,IF(H25=\"OK\",IF(F25<G25,F25,100+(F25-G25)),0),0)","v":0},null,null,{"$f":"VLOOKUP(A24,'Meldung (Reihung nach Spielnr.)'!$B$2:$C$97,2)","v":{"$error":"#N/A"}},{"$f":"VLOOKUP(A25,'Meldung (Reihung nach Spielnr.)'!$B$2:$C$97,2)","v":{"$error":"#N/A"}}]
[{"$f":"Auslosung6!G25","v":0},{"$f":"Auslosung6!H25","v":{"$error":"#N/A"}},{"$f":"IF(F25+G25>0,IF(H25=\"OK\",IF(G25<F25,G25,100+(G25-F25)),0),0)","v":0},null,null,null,0,{"$f":"IF(OR(F25>=15,G25>=15),\"OK\",\"Fehlende oder falsche EIngabe\")","v":"Fehlende oder falsche EIngabe"}]
[{"$f":"Auslosung6!G26","v":0},{"$f":"Auslosung6!H26","v":{"$error":"#N/A"}},{"$f":"IF(F27+G27>0,IF(H27=\"OK\",IF(F27<G27,F27,100+(F27-G27)),0),0)","v":0},null,null,{"$f":"VLOOKUP(A26,'Meldung (Reihung nach Spielnr.)'!$B$2:$C$97,2)","v":{"$error":"#N/A"}},{"$f":"VLOOKUP(A27,'Meldung (Reihung nach Spielnr.)'!$B$2:$C$97,2)","v":{"$error":"#N/A"}}]
[{"$f":"Auslosung6!G27","v":0},{"$f":"Auslosung6!H27","v":{"$error":"#N/A"}},{"$f":"IF(F27+G27>0,IF(H27=\"OK\",IF(G27<F27,G27,100+(G27-F27)),0),0)","v":0},null,null,null,0,{"$f":"IF(OR(F27>=15,G27>=15),\"OK\",\"Fehlende oder falsche EIngabe\")","v":"Fehlende oder falsche EIngabe"}]
[{"$f":"Auslosung6!G28","v":0},{"$f":"Auslosung6!H28","v":{"$error":"#N/A"}},{"$f":"IF(F29+G29>0,IF(H29=\"OK\",IF(F29<G29,F29,100+(F29-G29)),0),0)","v":0},null,null,{"$f":"VLOOKUP(A28,'Meldung (Reihung nach Spielnr.)'!$B$2:$C$97,2)","v":{"$error":"#N/A"}},{"$f":"VLOOKUP(A29,'Meldung (Reihung nach Spielnr.)'!$B$2:$C$97,2)","v":{"$error":"#N/A"}}]
[{"$f":"Auslosung6!G29","v":0},{"$f":"Auslosung6!H29","v":{"$error":"#N/A"}},{"$f":"IF(F29+G29>0,IF(H29=\"OK\",IF(G29<F29,G29,100+(G29-F29)),0),0)","v":0},null,null,null,0,{"$f":"IF(OR(F29>=15,G29>=15),\"OK\",\"Fehlende oder falsche EIngabe\")","v":"Fehlende oder falsche EIngabe"}]
[{"$f":"Auslosung6!G30","v":0},{"$f":"Auslosung6!H30","v":{"$error":"#N/A"}},{"$f":"IF(F31+G31>0,IF(H31=\"OK\",IF(F31<G31,F31,100+(F31-G31)),0),0)","v":0},null,null,{"$f":"VLOOKUP(A30,'Meldung (Reihung nach Spielnr.)'!$B$2:$C$97,2)","v":{"$error":"#N/A"}},{"$f":"VLOOKUP(A31,'Meldung (Reihung nach Spielnr.)'!$B$2:$C$97,2)","v":{"$error":"#N/A"}}]
[{"$f":"Auslosung6!G31","v":0},{"$f":"Auslosung6!H31","v":{"$error":"#N/A"}},{"$f":"IF(F31+G31>0,IF(H31=\"OK\",IF(G31<F31,G31,100+(G31-F31)),0),0)","v":0},null,null,null,0,{"$f":"IF(OR(F31>=15,G31>=15),\"OK\",\"Fehlende oder falsche EIngabe\")","v":"Fehlende oder falsche EIngabe"}]
[{"$f":"Auslosung6!G32","v":0},{"$f":"Auslosung6!H32","v":{"$error":"#N/A"}},{"$f":"IF(F33+G33>0,IF(H33=\"OK\",IF(F33<G33,F33,100+(F33-G33)),0),0)","v":0},null,null,{"$f":"VLOOKUP(A32,'Meldung (Reihung nach Spielnr.)'!$B$2:$C$97,2)","v":{"$error":"#N/A"}},{"$f":"VLOOKUP(A33,'Meldung (Reihung nach Spielnr.)'!$B$2:$C$97,2)","v":{"$error":"#N/A"}}]
[{"$f":"Auslosung6!G33","v":0},{"$f":"Auslosung6!H33","v":{"$error":"#N/A"}},{"$f":"IF(F33+G33>0,IF(H33=\"OK\",IF(G33<F33,G33,100+(G33-F33)),0),0)","v":0},null,null,null,0,{"$f":"IF(OR(F33>=15,G33>=15),\"OK\",\"Fehlende oder falsche EIngabe\")","v":"Fehlende oder falsche EIngabe"}]
[{"$f":"Auslosung6!G34","v":0},{"$f":"Auslosung6!H34","v":{"$error":"#N/A"}},{"$f":"IF(F35+G35>0,IF(H35=\"OK\",IF(F35<G35,F35,100+(F35-G35)),0),0)","v":0},null,null,{"$f":"VLOOKUP(A34,'Meldung (Reihung nach Spielnr.)'!$B$2:$C$97,2)","v":{"$error":"#N/A"}},{"$f":"VLOOKUP(A35,'Meldung (Reihung nach Spielnr.)'!$B$2:$C$97,2)","v":{"$error":"#N/A"}}]
[{"$f":"Auslosung6!G35","v":0},{"$f":"Auslosung6!H35","v":{"$error":"#N/A"}},{"$f":"IF(F35+G35>0,IF(H35=\"OK\",IF(G35<F35,G35,100+(G35-F35)),0),0)","v":0},null,null,null,0,{"$f":"IF(OR(F35>=15,G35>=15),\"OK\",\"Fehlende oder falsche EIngabe\")","v":"Fehlende oder falsche EIngabe"}]
[{"$f":"Auslosung6!G36","v":0},{"$f":"Auslosung6!H36","v":{"$error":"#N/A"}},{"$f":"IF(F37+G37>0,IF(H37=\"OK\",IF(F37<G37,F37,100+(F37-G37)),0),0)","v":0},null,null,{"$f":"VLOOKUP(A36,'Meldung (Reihung nach Spielnr.)'!$B$2:$C$97,2)","v":{"$error":"#N/A"}},{"$f":"VLOOKUP(A37,'Meldung (Reihung nach Spielnr.)'!$B$2:$C$97,2)","v":{"$error":"#N/A"}}]
[{"$f":"Auslosung6!G37","v":0},{"$f":"Auslosung6!H37","v":{"$error":"#N/A"}},{"$f":"IF(F37+G37>0,IF(H37=\"OK\",IF(G37<F37,G37,100+(G37-F37)),0),0)","v":0},null,null,null,0,{"$f":"IF(OR(F37>=15,G37>=15),\"OK\",\"Fehlende oder falsche EIngabe\")","v":"Fehlende oder falsche EIngabe"}]
[{"$f":"Auslosung6!G38","v":0},{"$f":"Auslosung6!H38","v":{"$error":"#N/A"}},{"$f":"IF(F39+G39>0,IF(H39=\"OK\",IF(F39<G39,F39,100+(F39-G39)),0),0)","v":0},null,null,{"$f":"VLOOKUP(A38,'Meldung (Reihung nach Spielnr.)'!$B$2:$C$97,2)","v":{"$error":"#N/A"}},{"$f":"VLOOKUP(A39,'Meldung (Reihung nach Spielnr.)'!$B$2:$C$97,2)","v":{"$error":"#N/A"}}]
[{"$f":"Auslosung6!G39","v":0},{"$f":"Auslosung6!H39","v":{"$error":"#N/A"}},{"$f":"IF(F39+G39>0,IF(H39=\"OK\",IF(G39<F39,G39,100+(G39-F39)),0),0)","v":0},null,null,null,0,{"$f":"IF(OR(F39>=15,G39>=15),\"OK\",\"Fehlende oder falsche EIngabe\")","v":"Fehlende oder falsche EIngabe"}]
[{"$f":"Auslosung6!G40","v":0},{"$f":"Auslosung6!H40","v":{"$error":"#N/A"}},{"$f":"IF(F41+G41>0,IF(H41=\"OK\",IF(F41<G41,F41,100+(F41-G41)),0),0)","v":0},null,null,{"$f":"VLOOKUP(A40,'Meldung (Reihung nach Spielnr.)'!$B$2:$C$97,2)","v":{"$error":"#N/A"}},{"$f":"VLOOKUP(A41,'Meldung (Reihung nach Spielnr.)'!$B$2:$C$97,2)","v":{"$error":"#N/A"}}]
[{"$f":"Auslosung6!G41","v":0},{"$f":"Auslosung6!H41","v":{"$error":"#N/A"}},{"$f":"IF(F41+G41>0,IF(H41=\"OK\",IF(G41<F41,G41,100+(G41-F41)),0),0)","v":0},null,null,null,0,{"$f":"IF(OR(F41>=15,G41>=15),\"OK\",\"Fehlende oder falsche EIngabe\")","v":"Fehlende oder falsche EIngabe"}]
[{"$f":"Auslosung6!G42","v":0},{"$f":"Auslosung6!H42","v":{"$error":"#N/A"}},{"$f":"IF(F43+G43>0,IF(H43=\"OK\",IF(F43<G43,F43,100+(F43-G43)),0),0)","v":0},null,null,{"$f":"VLOOKUP(A42,'Meldung (Reihung nach Spielnr.)'!$B$2:$C$97,2)","v":{"$error":"#N/A"}},{"$f":"VLOOKUP(A43,'Meldung (Reihung nach Spielnr.)'!$B$2:$C$97,2)","v":{"$error":"#N/A"}}]
[{"$f":"Auslosung6!G43","v":0},{"$f":"Auslosung6!H43","v":{"$error":"#N/A"}},{"$f":"IF(F43+G43>0,IF(H43=\"OK\",IF(G43<F43,G43,100+(G43-F43)),0),0)","v":0},null,null,null,0,{"$f":"IF(OR(F43>=15,G43>=15),\"OK\",\"Fehlende oder falsche EIngabe\")","v":"Fehlende oder falsche EIngabe"}]
[{"$f":"Auslosung6!G44","v":0},{"$f":"Auslosung6!H44","v":{"$error":"#N/A"}},{"$f":"IF(D44=15,100+(D44-E44),IF(D44<15,D44,100+(D44-E44)))","v":0},null,null,{"$f":"VLOOKUP(A44,'Meldung (Reihung nach Spielnr.)'!$B$2:$C$97,2)","v":{"$error":"#N/A"}},{"$f":"VLOOKUP(A45,'Meldung (Reihung nach Spielnr.)'!$B$2:$C$97,2)","v":{"$error":"#N/A"}}]
[{"$f":"Auslosung6!G45","v":0},{"$f":"Auslosung6!H45","v":{"$error":"#N/A"}},0,null,null,null,0,{"$f":"IF(OR(F45>=15,G45>=15),\"OK\",\"Fehlende oder falsche EIngabe\")","v":"Fehlende oder falsche EIngabe"}]
[{"$f":"Auslosung6!G46","v":0},{"$f":"Auslosung6!H46","v":{"$error":"#N/A"}},0,null,null,{"$f":"VLOOKUP(A46,'Meldung (Reihung nach Spielnr.)'!$B$2:$C$97,2)","v":{"$error":"#N/A"}},{"$f":"VLOOKUP(A47,'Meldung (Reihung nach Spielnr.)'!$B$2:$C$97,2)","v":{"$error":"#N/A"}}]
[{"$f":"Auslosung6!G47","v":0},{"$f":"Auslosung6!H47","v":{"$error":"#N/A"}},0,null,null,null,0,{"$f":"IF(OR(F47>=15,G47>=15),\"OK\",\"Fehlende oder falsche EIngabe\")","v":"Fehlende oder falsche EIngabe"}]
[{"$f":"Auslosung6!G48","v":0},{"$f":"Auslosung6!H48","v":{"$error":"#N/A"}},0,null,null,{"$f":"VLOOKUP(A48,'Meldung (Reihung nach Spielnr.)'!$B$2:$C$97,2)","v":{"$error":"#N/A"}},{"$f":"VLOOKUP(A49,'Meldung (Reihung nach Spielnr.)'!$B$2:$C$97,2)","v":{"$error":"#N/A"}}]
[{"$f":"Auslosung6!G49","v":0},{"$f":"Auslosung6!H49","v":{"$error":"#N/A"}},0,null,null,null,0,{"$f":"IF(OR(F49>=15,G49>=15),\"OK\",\"Fehlende oder falsche EIngabe\")","v":"Fehlende oder falsche EIngabe"}]
[{"$f":"Auslosung6!G50","v":0},{"$f":"Auslosung6!H50","v":{"$error":"#N/A"}},0,null,null,{"$f":"VLOOKUP(A50,'Meldung (Reihung nach Spielnr.)'!$B$2:$C$97,2)","v":{"$error":"#N/A"}},{"$f":"VLOOKUP(A51,'Meldung (Reihung nach Spielnr.)'!$B$2:$C$97,2)","v":{"$error":"#N/A"}}]
[{"$f":"Auslosung6!G51","v":0},{"$f":"Auslosung6!H51","v":{"$error":"#N/A"}},0,null,null,null,0,{"$f":"IF(OR(F51>=15,G51>=15),\"OK\",\"Fehlende oder falsche EIngabe\")","v":"Fehlende oder falsche EIngabe"}]
[{"$f":"Auslosung6!G52","v":0},{"$f":"Auslosung6!H52","v":{"$error":"#N/A"}},0,null,null,{"$f":"VLOOKUP(A52,'Meldung (Reihung nach Spielnr.)'!$B$2:$C$97,2)","v":{"$error":"#N/A"}},{"$f":"VLOOKUP(A53,'Meldung (Reihung nach Spielnr.)'!$B$2:$C$97,2)","v":{"$error":"#N/A"}}]
[{"$f":"Auslosung6!G53","v":0},{"$f":"Auslosung6!H53","v":{"$error":"#N/A"}},0,null,null,null,0,{"$f":"IF(OR(F53>=15,G53>=15),\"OK\",\"Fehlende oder falsche EIngabe\")","v":"Fehlende oder falsche EIngabe"}]
[{"$f":"Auslosung6!G54","v":0},{"$f":"Auslosung6!H54","v":{"$error":"#N/A"}},0,null,null,{"$f":"VLOOKUP(A54,'Meldung (Reihung nach Spielnr.)'!$B$2:$C$97,2)","v":{"$error":"#N/A"}},{"$f":"VLOOKUP(A55,'Meldung (Reihung nach Spielnr.)'!$B$2:$C$97,2)","v":{"$error":"#N/A"}}]
[{"$f":"Auslosung6!G55","v":0},{"$f":"Auslosung6!H55","v":{"$error":"#N/A"}},0,null,null,null,0,{"$f":"IF(OR(F55>=15,G55>=15),\"OK\",\"Fehlende oder falsche EIngabe\")","v":"Fehlende oder falsche EIngabe"}]
[{"$f":"Auslosung6!G56","v":0},{"$f":"Auslosung6!H56","v":{"$error":"#N/A"}},0,null,null,{"$f":"VLOOKUP(A56,'Meldung (Reihung nach Spielnr.)'!$B$2:$C$97,2)","v":{"$error":"#N/A"}},{"$f":"VLOOKUP(A57,'Meldung (Reihung nach Spielnr.)'!$B$2:$C$97,2)","v":{"$error":"#N/A"}}]
[{"$f":"Auslosung6!G57","v":0},{"$f":"Auslosung6!H57","v":{"$error":"#N/A"}},0,null,null,null,0,{"$f":"IF(OR(F57>=15,G57>=15),\"OK\",\"Fehlende oder falsche EIngabe\")","v":"Fehlende oder falsche EIngabe"}]
[{"$f":"Auslosung6!G58","v":0},{"$f":"Auslosung6!H58","v":{"$error":"#N/A"}},0,null,null,{"$f":"VLOOKUP(A58,'Meldung (Reihung nach Spielnr.)'!$B$2:$C$97,2)","v":{"$error":"#N/A"}},{"$f":"VLOOKUP(A59,'Meldung (Reihung nach Spielnr.)'!$B$2:$C$97,2)","v":{"$error":"#N/A"}}]
[{"$f":"Auslosung6!G59","v":0},{"$f":"Auslosung6!H59","v":{"$error":"#N/A"}},0,null,null,null,0,{"$f":"IF(OR(F59>=15,G59>=15),\"OK\",\"Fehlende oder falsche EIngabe\")","v":"Fehlende oder falsche EIngabe"}]
[{"$f":"Auslosung6!G60","v":0},{"$f":"Auslosung6!H60","v":{"$error":"#N/A"}},0,null,null,{"$f":"VLOOKUP(A60,'Meldung (Reihung nach Spielnr.)'!$B$2:$C$97,2)","v":{"$error":"#N/A"}},{"$f":"VLOOKUP(A61,'Meldung (Reihung nach Spielnr.)'!$B$2:$C$97,2)","v":{"$error":"#N/A"}}]
[{"$f":"Auslosung6!G61","v":0},{"$f":"Auslosung6!H61","v":{"$error":"#N/A"}},0,null,null,null,0,{"$f":"IF(OR(F61>=15,G61>=15),\"OK\",\"Fehlende oder falsche EIngabe\")","v":"Fehlende oder falsche EIngabe"}]
[{"$f":"Auslosung6!G62","v":0},{"$f":"Auslosung6!H62","v":{"$error":"#N/A"}},0,null,null,{"$f":"VLOOKUP(A62,'Meldung (Reihung nach Spielnr.)'!$B$2:$C$97,2)","v":{"$error":"#N/A"}},{"$f":"VLOOKUP(A63,'Meldung (Reihung nach Spielnr.)'!$B$2:$C$97,2)","v":{"$error":"#N/A"}}]
[{"$f":"Auslosung6!G63","v":0},{"$f":"Auslosung6!H63","v":{"$error":"#N/A"}},0,null,null,null,0,{"$f":"IF(OR(F63>=15,G63>=15),\"OK\",\"Fehlende oder falsche EIngabe\")","v":"Fehlende oder falsche EIngabe"}]
[{"$f":"Auslosung6!G64","v":0},{"$f":"Auslosung6!H64","v":{"$error":"#N/A"}},0,null,null,{"$f":"VLOOKUP(A64,'Meldung (Reihung nach Spielnr.)'!$B$2:$C$97,2)","v":{"$error":"#N/A"}},{"$f":"VLOOKUP(A65,'Meldung (Reihung nach Spielnr.)'!$B$2:$C$97,2)","v":{"$error":"#N/A"}}]
[{"$f":"Auslosung6!G65","v":0},{"$f":"Auslosung6!H65","v":{"$error":"#N/A"}},0,null,null,null,0,{"$f":"IF(OR(F65>=15,G65>=15),\"OK\",\"Fehlende oder falsche EIngabe\")","v":"Fehlende oder falsche EIngabe"}]
[{"$f":"Auslosung6!G66","v":0},{"$f":"Auslosung6!H66","v":{"$error":"#N/A"}},0,null,null,{"$f":"VLOOKUP(A66,'Meldung (Reihung nach Spielnr.)'!$B$2:$C$97,2)","v":{"$error":"#N/A"}},{"$f":"VLOOKUP(A67,'Meldung (Reihung nach Spielnr.)'!$B$2:$C$97,2)","v":{"$error":"#N/A"}}]
[{"$f":"Auslosung6!G67","v":0},{"$f":"Auslosung6!H67","v":{"$error":"#N/A"}},{"$f":"IF(D67=15,100+(D67-E67),IF(D67<15,D67,100+(D67-E67)))","v":0},null,null,null,0,{"$f":"IF(OR(F67>=15,G67>=15),\"OK\",\"Fehlende oder falsche EIngabe\")","v":"Fehlende oder falsche EIngabe"}]
[{"$f":"Auslosung6!G68","v":0},{"$f":"Auslosung6!H68","v":{"$error":"#N/A"}},0,null,null,{"$f":"VLOOKUP(A68,'Meldung (Reihung nach Spielnr.)'!$B$2:$C$97,2)","v":{"$error":"#N/A"}},{"$f":"VLOOKUP(A69,'Meldung (Reihung nach Spielnr.)'!$B$2:$C$97,2)","v":{"$error":"#N/A"}}]
[{"$f":"Auslosung6!G69","v":0},{"$f":"Auslosung6!H69","v":{"$error":"#N/A"}},0,null,null,null,0,{"$f":"IF(OR(F69>=15,G69>=15),\"OK\",\"Fehlende oder falsche EIngabe\")","v":"Fehlende oder falsche EIngabe"}]
[{"$f":"Auslosung6!G70","v":0},{"$f":"Auslosung6!H70","v":{"$error":"#N/A"}},0,null,null,{"$f":"VLOOKUP(A70,'Meldung (Reihung nach Spielnr.)'!$B$2:$C$97,2)","v":{"$error":"#N/A"}},{"$f":"VLOOKUP(A71,'Meldung (Reihung nach Spielnr.)'!$B$2:$C$97,2)","v":{"$error":"#N/A"}}]
[{"$f":"Auslosung6!G71","v":0},{"$f":"Auslosung6!H71","v":{"$error":"#N/A"}},0,null,null,null,0,{"$f":"IF(OR(F71>=15,G71>=15),\"OK\",\"Fehlende oder falsche EIngabe\")","v":"Fehlende oder falsche EIngabe"}]
[{"$f":"Auslosung6!G72","v":0},{"$f":"Auslosung6!H72","v":{"$error":"#N/A"}},0,null,null,{"$f":"VLOOKUP(A72,'Meldung (Reihung nach Spielnr.)'!$B$2:$C$97,2)","v":{"$error":"#N/A"}},{"$f":"VLOOKUP(A73,'Meldung (Reihung nach Spielnr.)'!$B$2:$C$97,2)","v":{"$error":"#N/A"}}]
[{"$f":"Auslosung6!G73","v":0},{"$f":"Auslosung6!H73","v":{"$error":"#N/A"}},0,null,null,null,0,{"$f":"IF(OR(F73>=15,G73>=15),\"OK\",\"Fehlende oder falsche EIngabe\")","v":"Fehlende oder falsche EIngabe"}]
[{"$f":"Auslosung6!G74","v":0},{"$f":"Auslosung6!H74","v":{"$error":"#N/A"}},0,null,null,{"$f":"VLOOKUP(A74,'Meldung (Reihung nach Spielnr.)'!$B$2:$C$97,2)","v":{"$error":"#N/A"}},{"$f":"VLOOKUP(A75,'Meldung (Reihung nach Spielnr.)'!$B$2:$C$97,2)","v":{"$error":"#N/A"}}]
[{"$f":"Auslosung6!G75","v":0},{"$f":"Auslosung6!H75","v":{"$error":"#N/A"}},0,null,null,null,0,{"$f":"IF(OR(F75>=15,G75>=15),\"OK\",\"Fehlende oder falsche EIngabe\")","v":"Fehlende oder falsche EIngabe"}]
[{"$f":"Auslosung6!G76","v":0},{"$f":"Auslosung6!H76","v":{"$error":"#N/A"}},0,null,null,{"$f":"VLOOKUP(A76,'Meldung (Reihung nach Spielnr.)'!$B$2:$C$97,2)","v":{"$error":"#N/A"}},{"$f":"VLOOKUP(A77,'Meldung (Reihung nach Spielnr.)'!$B$2:$C$97,2)","v":{"$error":"#N/A"}}]
[{"$f":"Auslosung6!G77","v":0},{"$f":"Auslosung6!H77","v":{"$error":"#N/A"}},0,null,null,null,0,{"$f":"IF(OR(F77>=15,G77>=15),\"OK\",\"Fehlende oder falsche EIngabe\")","v":"Fehlende oder falsche EIngabe"}]
[{"$f":"Auslosung6!G78","v":0},{"$f":"Auslosung6!H78","v":{"$error":"#N/A"}},0,null,null,{"$f":"VLOOKUP(A78,'Meldung (Reihung nach Spielnr.)'!$B$2:$C$97,2)","v":{"$error":"#N/A"}},{"$f":"VLOOKUP(A79,'Meldung (Reihung nach Spielnr.)'!$B$2:$C$97,2)","v":{"$error":"#N/A"}}]
[{"$f":"Auslosung6!G79","v":0},{"$f":"Auslosung6!H79","v":{"$error":"#N/A"}},0,null,null,null,0,{"$f":"IF(OR(F79>=15,G79>=15),\"OK\",\"Fehlende oder falsche EIngabe\")","v":"Fehlende oder falsche EIngabe"}]
[{"$f":"Auslosung6!G80","v":0},{"$f":"Auslosung6!H80","v":{"$error":"#N/A"}},0,null,null,{"$f":"VLOOKUP(A80,'Meldung (Reihung nach Spielnr.)'!$B$2:$C$97,2)","v":{"$error":"#N/A"}},{"$f":"VLOOKUP(A81,'Meldung (Reihung nach Spielnr.)'!$B$2:$C$97,2)","v":{"$error":"#N/A"}}]
[{"$f":"Auslosung6!G81","v":0},{"$f":"Auslosung6!H81","v":{"$error":"#N/A"}},0,null,null,null,0,{"$f":"IF(OR(F81>=15,G81>=15),\"OK\",\"Fehlende oder falsche EIngabe\")","v":"Fehlende oder falsche EIngabe"}]
[{"$f":"Auslosung6!G82","v":0},{"$f":"Auslosung6!H82","v":{"$error":"#N/A"}},0,null,null,{"$f":"VLOOKUP(A82,'Meldung (Reihung nach Spielnr.)'!$B$2:$C$97,2)","v":{"$error":"#N/A"}},{"$f":"VLOOKUP(A83,'Meldung (Reihung nach Spielnr.)'!$B$2:$C$97,2)","v":{"$error":"#N/A"}}]
[{"$f":"Auslosung6!G83","v":0},{"$f":"Auslosung6!H83","v":{"$error":"#N/A"}},0,null,null,null,0,{"$f":"IF(OR(F83>=15,G83>=15),\"OK\",\"Fehlende oder falsche EIngabe\")","v":"Fehlende oder falsche EIngabe"}]
[{"$f":"Auslosung6!G84","v":0},{"$f":"Auslosung6!H84","v":{"$error":"#N/A"}},0,null,null,{"$f":"VLOOKUP(A84,'Meldung (Reihung nach Spielnr.)'!$B$2:$C$97,2)","v":{"$error":"#N/A"}},{"$f":"VLOOKUP(A85,'Meldung (Reihung nach Spielnr.)'!$B$2:$C$97,2)","v":{"$error":"#N/A"}}]
[{"$f":"Auslosung6!G85","v":0},{"$f":"Auslosung6!H85","v":{"$error":"#N/A"}},0,null,null,null,0,{"$f":"IF(OR(F85>=15,G85>=15),\"OK\",\"Fehlende oder falsche EIngabe\")","v":"Fehlende oder falsche EIngabe"}]
[{"$f":"Auslosung6!G86","v":0},{"$f":"Auslosung6!H86","v":{"$error":"#N/A"}},0,null,null,{"$f":"VLOOKUP(A86,'Meldung (Reihung nach Spielnr.)'!$B$2:$C$97,2)","v":{"$error":"#N/A"}},{"$f":"VLOOKUP(A87,'Meldung (Reihung nach Spielnr.)'!$B$2:$C$97,2)","v":{"$error":"#N/A"}}]
[{"$f":"Auslosung6!G87","v":0},{"$f":"Auslosung6!H87","v":{"$error":"#N/A"}},0,null,null,null,0,{"$f":"IF(OR(F87>=15,G87>=15),\"OK\",\"Fehlende oder falsche EIngabe\")","v":"Fehlende oder falsche EIngabe"}]
[{"$f":"Auslosung6!G88","v":0},{"$f":"Auslosung6!H88","v":{"$error":"#N/A"}},0,null,null,{"$f":"VLOOKUP(A88,'Meldung (Reihung nach Spielnr.)'!$B$2:$C$97,2)","v":{"$error":"#N/A"}},{"$f":"VLOOKUP(A89,'Meldung (Reihung nach Spielnr.)'!$B$2:$C$97,2)","v":{"$error":"#N/A"}}]
[{"$f":"Auslosung6!G89","v":0},{"$f":"Auslosung6!H89","v":{"$error":"#N/A"}},0,null,null,null,0,{"$f":"IF(OR(F89>=15,G89>=15),\"OK\",\"Fehlende oder falsche EIngabe\")","v":"Fehlende oder falsche EIngabe"}]
[{"$f":"Auslosung6!G90","v":0},{"$f":"Auslosung6!H90","v":{"$error":"#N/A"}},0,null,null,{"$f":"VLOOKUP(A90,'Meldung (Reihung nach Spielnr.)'!$B$2:$C$97,2)","v":{"$error":"#N/A"}},{"$f":"VLOOKUP(A91,'Meldung (Reihung nach Spielnr.)'!$B$2:$C$97,2)","v":{"$error":"#N/A"}}]
[{"$f":"Auslosung6!G91","v":0},{"$f":"Auslosung6!H91","v":{"$error":"#N/A"}},0,null,null,null,0,{"$f":"IF(OR(F91>=15,G91>=15),\"OK\",\"Fehlende oder falsche EIngabe\")","v":"Fehlende oder falsche EIngabe"}]
[{"$f":"Auslosung6!G92","v":0},{"$f":"Auslosung6!H92","v":{"$error":"#N/A"}},0,null,null,{"$f":"VLOOKUP(A92,'Meldung (Reihung nach Spielnr.)'!$B$2:$C$97,2)","v":{"$error":"#N/A"}},{"$f":"VLOOKUP(A93,'Meldung (Reihung nach Spielnr.)'!$B$2:$C$97,2)","v":{"$error":"#N/A"}}]
[{"$f":"Auslosung6!G93","v":0},{"$f":"Auslosung6!H93","v":{"$error":"#N/A"}},0,null,null,null,0,{"$f":"IF(OR(F93>=15,G93>=15),\"OK\",\"Fehlende oder falsche EIngabe\")","v":"Fehlende oder falsche EIngabe"}]
[{"$f":"Auslosung6!G94","v":0},{"$f":"Auslosung6!H94","v":{"$error":"#N/A"}},0,null,null,{"$f":"VLOOKUP(A94,'Meldung (Reihung nach Spielnr.)'!$B$2:$C$97,2)","v":{"$error":"#N/A"}},{"$f":"VLOOKUP(A95,'Meldung (Reihung nach Spielnr.)'!$B$2:$C$97,2)","v":{"$error":"#N/A"}}]
[{"$f":"Auslosung6!G95","v":0},{"$f":"Auslosung6!H95","v":{"$error":"#N/A"}},0,null,null,null,0,{"$f":"IF(OR(F95>=15,G95>=15),\"OK\",\"Fehlende oder falsche EIngabe\")","v":"Fehlende oder falsche EIngabe"}]
[{"$f":"Auslosung6!G96","v":0},{"$f":"Auslosung6!H96","v":{"$error":"#N/A"}},0,null,null,{"$f":"VLOOKUP(A96,'Meldung (Reihung nach Spielnr.)'!$B$2:$C$97,2)","v":{"$error":"#N/A"}},{"$f":"VLOOKUP(A97,'Meldung (Reihung nach Spielnr.)'!$B$2:$C$97,2)","v":{"$error":"#N/A"}}]
[{"$f":"Auslosung6!G97","v":0},{"$f":"Auslosung6!H97","v":{"$error":"#N/A"}},0,null,null,null,0,{"$f":"IF(OR(F97>=15,G97>=15),\"OK\",\"Fehlende oder falsche EIngabe\")","v":"Fehlende oder falsche EIngabe"}]

{"sheet":"Auslosung7","index":14,"n_rows":97,"n_cols":8,"rows_kept":97,"cut":false,"hidden":false,"merged":[]}
[20,"Geben Sie in die grüne Zelle, die Anzahl der Mitspieler ein",null,null,"Zahl","TISCH","Spieler Nr.","Name"]
[19,{"$f":"Auslosung1!B2","v":20},null,null,1,1,{"$f":"A1","v":20},{"$f":"VLOOKUP(A1,'Meldung (Reihung nach Spielnr.)'!$B$2:$C$97,2)","v":"Krissmer Reinhard | Fringer Fred"}]
[4,{"$f":"'Meldung (Reihung nach Spielnr.)'!M1","v":20},null,null,2,1,{"$f":"A2","v":19},{"$f":"VLOOKUP(A2,'Meldung (Reihung nach Spielnr.)'!$B$2:$C$97,2)","v":"Kurt Zebisch | Mr. Bean"}]
[2,null,null,null,3,2,4,{"$f":"VLOOKUP(A3,'Meldung (Reihung nach Spielnr.)'!$B$2:$C$97,2)","v":"Andi Krajic u Peter Doblander/Tarrenz"}]
[5,null,null,null,4,2,2,{"$f":"VLOOKUP(A4,'Meldung (Reihung nach Spielnr.)'!$B$2:$C$97,2)","v":"Annette u Veronika/Telfs"}]
[9,null,null,null,5,3,5,{"$f":"VLOOKUP(A5,'Meldung (Reihung nach Spielnr.)'!$B$2:$C$97,2)","v":"Gerhard Schuler u Meinhard Eiter/Imst"}]
[3,null,null,null,6,3,9,{"$f":"VLOOKUP(A6,'Meldung (Reihung nach Spielnr.)'!$B$2:$C$97,2)","v":"Rudi Kastner u Peter Tschenett/Imst"}]
[10,null,null,null,7,4,3,{"$f":"VLOOKUP(A7,'Meldung (Reihung nach Spielnr.)'!$B$2:$C$97,2)","v":"Hubert Auer u Daniela Nöbauer/Telfs"}]
[8,null,null,null,8,4,10,{"$f":"VLOOKUP(A8,'Meldung (Reihung nach Spielnr.)'!$B$2:$C$97,2)","v":"Franz Pellegrini u Hans Matha/Südtirol"}]
[13,null,null,null,9,5,8,{"$f":"VLOOKUP(A9,'Meldung (Reihung nach Spielnr.)'!$B$2:$C$97,2)","v":"Herbert Lechleitner u  Stefan Krabichler/Imst"}]
[1,null,null,null,10,5,13,{"$f":"VLOOKUP(A10,'Meldung (Reihung nach Spielnr.)'!$B$2:$C$97,2)","v":"Peter Auer u Stefan Sarg/Axams"}]
[15,null,null,null,11,6,1,{"$f":"VLOOKUP(A11,'Meldung (Reihung nach Spielnr.)'!$B$2:$C$97,2)","v":"Edi u Gerald/Telfs"}]
[17,null,null,null,12,6,15,{"$f":"VLOOKUP(A12,'Meldung (Reihung nach Spielnr.)'!$B$2:$C$97,2)","v":"Bernhard Meischberger u Martin Staggl/Kematen"}]
[14,null,null,null,13,7,17,{"$f":"VLOOKUP(A13,'Meldung (Reihung nach Spielnr.)'!$B$2:$C$97,2)","v":"Karin Logar u Rudolf Häusler/Kematen"}]
[11,null,null,null,14,7,14,{"$f":"VLOOKUP(A14,'Meldung (Reihung nach Spielnr.)'!$B$2:$C$97,2)","v":"Hansjörg Hell u Franz Braunegger/Axams"}]
[18,null,null,null,15,8,11,{"$f":"VLOOKUP(A15,'Meldung (Reihung nach Spielnr.)'!$B$2:$C$97,2)","v":"Heini Gruber u Gottfried Geier/Südtirol"}]
[12,null,null,null,16,8,18,{"$f":"VLOOKUP(A16,'Meldung (Reihung nach Spielnr.)'!$B$2:$C$97,2)","v":"Josef Eisenbeutl u Herbert Gamper/Imst"}]
[7,null,null,null,17,9,12,{"$f":"VLOOKUP(A17,'Meldung (Reihung nach Spielnr.)'!$B$2:$C$97,2)","v":"Heinrich Ebner u Erich Peer/Südtirol"}]
[16,null,null,null,18,9,7,{"$f":"VLOOKUP(A18,'Meldung (Reihung nach Spielnr.)'!$B$2:$C$97,2)","v":"Thomas Heltschl u Fredl Mungenast/Imst"}]
[6,null,null,null,19,10,16,{"$f":"VLOOKUP(A19,'Meldung (Reihung nach Spielnr.)'!$B$2:$C$97,2)","v":"Hermann Lechner u Andreas Oberacher/Kematen"}]
[null,null,null,null,20,10,6,{"$f":"VLOOKUP(A20,'Meldung (Reihung nach Spielnr.)'!$B$2:$C$97,2)","v":"Hans Perktold u Horst Friedl/Imst"}]
[null,null,null,null,21,11,0,{"$f":"VLOOKUP(A21,'Meldung (Reihung nach Spielnr.)'!$B$2:$C$97,2)","v":{"$error":"#N/A"}}]
[null,null,null,null,22,11,0,{"$f":"VLOOKUP(A22,'Meldung (Reihung nach Spielnr.)'!$B$2:$C$97,2)","v":{"$error":"#N/A"}}]
[null,null,null,null,23,12,0,{"$f":"VLOOKUP(A23,'Meldung (Reihung nach Spielnr.)'!$B$2:$C$97,2)","v":{"$error":"#N/A"}}]
[null,null,null,null,24,12,0,{"$f":"VLOOKUP(A24,'Meldung (Reihung nach Spielnr.)'!$B$2:$C$97,2)","v":{"$error":"#N/A"}}]
[null,null,null,null,25,13,0,{"$f":"VLOOKUP(A25,'Meldung (Reihung nach Spielnr.)'!$B$2:$C$97,2)","v":{"$error":"#N/A"}}]
[null,null,null,null,26,13,0,{"$f":"VLOOKUP(A26,'Meldung (Reihung nach Spielnr.)'!$B$2:$C$97,2)","v":{"$error":"#N/A"}}]
[null,null,null,null,27,14,0,{"$f":"VLOOKUP(A27,'Meldung (Reihung nach Spielnr.)'!$B$2:$C$97,2)","v":{"$error":"#N/A"}}]
[null,null,null,null,28,14,0,{"$f":"VLOOKUP(A28,'Meldung (Reihung nach Spielnr.)'!$B$2:$C$97,2)","v":{"$error":"#N/A"}}]
[null,null,null,null,29,15,0,{"$f":"VLOOKUP(A29,'Meldung (Reihung nach Spielnr.)'!$B$2:$C$97,2)","v":{"$error":"#N/A"}}]
[null,null,null,null,30,15,0,{"$f":"VLOOKUP(A30,'Meldung (Reihung nach Spielnr.)'!$B$2:$C$97,2)","v":{"$error":"#N/A"}}]
[null,null,null,null,31,16,0,{"$f":"VLOOKUP(A31,'Meldung (Reihung nach Spielnr.)'!$B$2:$C$97,2)","v":{"$error":"#N/A"}}]
[null,null,null,null,32,16,0,{"$f":"VLOOKUP(A32,'Meldung (Reihung nach Spielnr.)'!$B$2:$C$97,2)","v":{"$error":"#N/A"}}]
[null,null,null,null,33,17,0,{"$f":"VLOOKUP(A33,'Meldung (Reihung nach Spielnr.)'!$B$2:$C$97,2)","v":{"$error":"#N/A"}}]
[null,null,null,null,34,17,0,{"$f":"VLOOKUP(A34,'Meldung (Reihung nach Spielnr.)'!$B$2:$C$97,2)","v":{"$error":"#N/A"}}]
[null,null,null,null,35,18,0,{"$f":"VLOOKUP(A35,'Meldung (Reihung nach Spielnr.)'!$B$2:$C$97,2)","v":{"$error":"#N/A"}}]
[null,null,null,null,36,18,0,{"$f":"VLOOKUP(A36,'Meldung (Reihung nach Spielnr.)'!$B$2:$C$97,2)","v":{"$error":"#N/A"}}]
[null,null,null,null,37,19,0,{"$f":"VLOOKUP(A37,'Meldung (Reihung nach Spielnr.)'!$B$2:$C$97,2)","v":{"$error":"#N/A"}}]
[null,null,null,null,38,19,0,{"$f":"VLOOKUP(A38,'Meldung (Reihung nach Spielnr.)'!$B$2:$C$97,2)","v":{"$error":"#N/A"}}]
[null,null,null,null,39,20,0,{"$f":"VLOOKUP(A39,'Meldung (Reihung nach Spielnr.)'!$B$2:$C$97,2)","v":{"$error":"#N/A"}}]
[null,null,null,null,40,20,0,{"$f":"VLOOKUP(A40,'Meldung (Reihung nach Spielnr.)'!$B$2:$C$97,2)","v":{"$error":"#N/A"}}]
[null,null,null,null,41,21,0,{"$f":"VLOOKUP(A41,'Meldung (Reihung nach Spielnr.)'!$B$2:$C$97,2)","v":{"$error":"#N/A"}}]
[null,null,null,null,42,21,0,{"$f":"VLOOKUP(A42,'Meldung (Reihung nach Spielnr.)'!$B$2:$C$97,2)","v":{"$error":"#N/A"}}]
[null,null,null,null,43,22,0,{"$f":"VLOOKUP(A43,'Meldung (Reihung nach Spielnr.)'!$B$2:$C$97,2)","v":{"$error":"#N/A"}}]
[null,null,null,null,44,22,0,{"$f":"VLOOKUP(A44,'Meldung (Reihung nach Spielnr.)'!$B$2:$C$97,2)","v":{"$error":"#N/A"}}]
[null,null,null,null,45,23,0,{"$f":"VLOOKUP(A45,'Meldung (Reihung nach Spielnr.)'!$B$2:$C$97,2)","v":{"$error":"#N/A"}}]
[null,null,null,null,46,23,0,{"$f":"VLOOKUP(A46,'Meldung (Reihung nach Spielnr.)'!$B$2:$C$97,2)","v":{"$error":"#N/A"}}]
[null,null,null,null,47,24,0,{"$f":"VLOOKUP(A47,'Meldung (Reihung nach Spielnr.)'!$B$2:$C$97,2)","v":{"$error":"#N/A"}}]
[null,null,null,null,48,24,0,{"$f":"VLOOKUP(A48,'Meldung (Reihung nach Spielnr.)'!$B$2:$C$97,2)","v":{"$error":"#N/A"}}]
[null,null,null,null,49,25,0,{"$f":"VLOOKUP(A49,'Meldung (Reihung nach Spielnr.)'!$B$2:$C$97,2)","v":{"$error":"#N/A"}}]
[null,null,null,null,50,25,0,{"$f":"VLOOKUP(A50,'Meldung (Reihung nach Spielnr.)'!$B$2:$C$97,2)","v":{"$error":"#N/A"}}]
[null,null,null,null,51,26,0,{"$f":"VLOOKUP(A51,'Meldung (Reihung nach Spielnr.)'!$B$2:$C$97,2)","v":{"$error":"#N/A"}}]
[null,null,null,null,52,26,0,{"$f":"VLOOKUP(A52,'Meldung (Reihung nach Spielnr.)'!$B$2:$C$97,2)","v":{"$error":"#N/A"}}]
[null,null,null,null,53,27,0,{"$f":"VLOOKUP(A53,'Meldung (Reihung nach Spielnr.)'!$B$2:$C$97,2)","v":{"$error":"#N/A"}}]
[null,null,null,null,54,27,0,{"$f":"VLOOKUP(A54,'Meldung (Reihung nach Spielnr.)'!$B$2:$C$97,2)","v":{"$error":"#N/A"}}]
[null,null,null,null,55,28,0,{"$f":"VLOOKUP(A55,'Meldung (Reihung nach Spielnr.)'!$B$2:$C$97,2)","v":{"$error":"#N/A"}}]
[null,null,null,null,56,28,0,{"$f":"VLOOKUP(A56,'Meldung (Reihung nach Spielnr.)'!$B$2:$C$97,2)","v":{"$error":"#N/A"}}]
[null,null,null,null,57,29,0,{"$f":"VLOOKUP(A57,'Meldung (Reihung nach Spielnr.)'!$B$2:$C$97,2)","v":{"$error":"#N/A"}}]
[null,null,null,null,58,29,0,{"$f":"VLOOKUP(A58,'Meldung (Reihung nach Spielnr.)'!$B$2:$C$97,2)","v":{"$error":"#N/A"}}]
[null,null,null,null,59,30,0,{"$f":"VLOOKUP(A59,'Meldung (Reihung nach Spielnr.)'!$B$2:$C$97,2)","v":{"$error":"#N/A"}}]
[null,null,null,null,60,30,0,{"$f":"VLOOKUP(A60,'Meldung (Reihung nach Spielnr.)'!$B$2:$C$97,2)","v":{"$error":"#N/A"}}]
[null,null,null,null,61,31,0,{"$f":"VLOOKUP(A61,'Meldung (Reihung nach Spielnr.)'!$B$2:$C$97,2)","v":{"$error":"#N/A"}}]
[null,null,null,null,62,31,0,{"$f":"VLOOKUP(A62,'Meldung (Reihung nach Spielnr.)'!$B$2:$C$97,2)","v":{"$error":"#N/A"}}]
[null,null,null,null,63,32,0,{"$f":"VLOOKUP(A63,'Meldung (Reihung nach Spielnr.)'!$B$2:$C$97,2)","v":{"$error":"#N/A"}}]
[null,null,null,null,64,32,0,{"$f":"VLOOKUP(A64,'Meldung (Reihung nach Spielnr.)'!$B$2:$C$97,2)","v":{"$error":"#N/A"}}]
[null,null,null,null,65,33,0,{"$f":"VLOOKUP(A65,'Meldung (Reihung nach Spielnr.)'!$B$2:$C$97,2)","v":{"$error":"#N/A"}}]
[null,null,null,null,66,33,{"$f":"A66","v":0},{"$f":"VLOOKUP(A66,'Meldung (Reihung nach Spielnr.)'!$B$2:$C$97,2)","v":{"$error":"#N/A"}}]
[null,null,null,null,67,17,0,{"$f":"VLOOKUP(A67,'Meldung (Reihung nach Spielnr.)'!$B$2:$C$97,2)","v":{"$error":"#N/A"}}]
[null,null,null,null,68,34,0,{"$f":"VLOOKUP(A68,'Meldung (Reihung nach Spielnr.)'!$B$2:$C$97,2)","v":{"$error":"#N/A"}}]
[null,null,null,null,69,34,0,{"$f":"VLOOKUP(A69,'Meldung (Reihung nach Spielnr.)'!$B$2:$C$97,2)","v":{"$error":"#N/A"}}]
[null,null,null,null,70,35,0,{"$f":"VLOOKUP(A70,'Meldung (Reihung nach Spielnr.)'!$B$2:$C$97,2)","v":{"$error":"#N/A"}}]
[null,null,null,null,71,35,0,{"$f":"VLOOKUP(A71,'Meldung (Reihung nach Spielnr.)'!$B$2:$C$97,2)","v":{"$error":"#N/A"}}]
[null,null,null,null,72,36,0,{"$f":"VLOOKUP(A72,'Meldung (Reihung nach Spielnr.)'!$B$2:$C$97,2)","v":{"$error":"#N/A"}}]
[null,null,null,null,73,36,0,{"$f":"VLOOKUP(A73,'Meldung (Reihung nach Spielnr.)'!$B$2:$C$97,2)","v":{"$error":"#N/A"}}]
[null,null,null,null,74,36,0,{"$f":"VLOOKUP(A74,'Meldung (Reihung nach Spielnr.)'!$B$2:$C$97,2)","v":{"$error":"#N/A"}}]
[null,null,null,null,75,37,0,{"$f":"VLOOKUP(A75,'Meldung (Reihung nach Spielnr.)'!$B$2:$C$97,2)","v":{"$error":"#N/A"}}]
[null,null,null,null,76,37,0,{"$f":"VLOOKUP(A76,'Meldung (Reihung nach Spielnr.)'!$B$2:$C$97,2)","v":{"$error":"#N/A"}}]
[null,null,null,null,77,38,0,{"$f":"VLOOKUP(A77,'Meldung (Reihung nach Spielnr.)'!$B$2:$C$97,2)","v":{"$error":"#N/A"}}]
[null,null,null,null,78,38,0,{"$f":"VLOOKUP(A78,'Meldung (Reihung nach Spielnr.)'!$B$2:$C$97,2)","v":{"$error":"#N/A"}}]
[null,null,null,null,79,39,0,{"$f":"VLOOKUP(A79,'Meldung (Reihung nach Spielnr.)'!$B$2:$C$97,2)","v":{"$error":"#N/A"}}]
[null,null,null,null,80,39,0,{"$f":"VLOOKUP(A80,'Meldung (Reihung nach Spielnr.)'!$B$2:$C$97,2)","v":{"$error":"#N/A"}}]
[null,null,null,null,81,40,0,{"$f":"VLOOKUP(A81,'Meldung (Reihung nach Spielnr.)'!$B$2:$C$97,2)","v":{"$error":"#N/A"}}]
[null,null,null,null,82,40,0,{"$f":"VLOOKUP(A82,'Meldung (Reihung nach Spielnr.)'!$B$2:$C$97,2)","v":{"$error":"#N/A"}}]
[null,null,null,null,83,41,0,{"$f":"VLOOKUP(A83,'Meldung (Reihung nach Spielnr.)'!$B$2:$C$97,2)","v":{"$error":"#N/A"}}]
[null,null,null,null,84,41,0,{"$f":"VLOOKUP(A84,'Meldung (Reihung nach Spielnr.)'!$B$2:$C$97,2)","v":{"$error":"#N/A"}}]
[null,null,null,null,85,42,0,{"$f":"VLOOKUP(A85,'Meldung (Reihung nach Spielnr.)'!$B$2:$C$97,2)","v":{"$error":"#N/A"}}]
[null,null,null,null,86,42,0,{"$f":"VLOOKUP(A86,'Meldung (Reihung nach Spielnr.)'!$B$2:$C$97,2)","v":{"$error":"#N/A"}}]
[null,null,null,null,87,43,0,{"$f":"VLOOKUP(A87,'Meldung (Reihung nach Spielnr.)'!$B$2:$C$97,2)","v":{"$error":"#N/A"}}]
[null,null,null,null,88,4,0,{"$f":"VLOOKUP(A88,'Meldung (Reihung nach Spielnr.)'!$B$2:$C$97,2)","v":{"$error":"#N/A"}}]
[null,null,null,null,89,44,0,{"$f":"VLOOKUP(A89,'Meldung (Reihung nach Spielnr.)'!$B$2:$C$97,2)","v":{"$error":"#N/A"}}]
[null,null,null,null,90,44,0,{"$f":"VLOOKUP(A90,'Meldung (Reihung nach Spielnr.)'!$B$2:$C$97,2)","v":{"$error":"#N/A"}}]
[null,null,null,null,91,45,0,{"$f":"VLOOKUP(A91,'Meldung (Reihung nach Spielnr.)'!$B$2:$C$97,2)","v":{"$error":"#N/A"}}]
[null,null,null,null,92,45,0,{"$f":"VLOOKUP(A92,'Meldung (Reihung nach Spielnr.)'!$B$2:$C$97,2)","v":{"$error":"#N/A"}}]
[null,null,null,null,93,46,0,{"$f":"VLOOKUP(A93,'Meldung (Reihung nach Spielnr.)'!$B$2:$C$97,2)","v":{"$error":"#N/A"}}]
[null,null,null,null,94,46,0,{"$f":"VLOOKUP(A94,'Meldung (Reihung nach Spielnr.)'!$B$2:$C$97,2)","v":{"$error":"#N/A"}}]
[null,null,null,null,95,47,0,{"$f":"VLOOKUP(A95,'Meldung (Reihung nach Spielnr.)'!$B$2:$C$97,2)","v":{"$error":"#N/A"}}]
[null,null,null,null,96,47,0,{"$f":"VLOOKUP(A96,'Meldung (Reihung nach Spielnr.)'!$B$2:$C$97,2)","v":{"$error":"#N/A"}}]

{"sheet":"Runde 7","index":15,"n_rows":97,"n_cols":8,"rows_kept":97,"cut":false,"hidden":false,"merged":[[0,3,0,4]]}
["Paar-Nr.","Name","Runde 4",null,null,"Punkte","Punkte",15]
[{"$f":"Auslosung7!G2","v":20},{"$f":"Auslosung7!H2","v":"Krissmer Reinhard | Fringer Fred"},{"$f":"IF(F3+G3>0,IF(H3=\"OK\",IF(F3<G3,F3,100+(F3-G3)),0),0)","v":0},null,null,{"$f":"VLOOKUP(A2,'Meldung (Reihung nach Spielnr.)'!$B$2:$C$97,2)","v":"Krissmer Reinhard | Fringer Fred"},{"$f":"VLOOKUP(A3,'Meldung (Reihung nach Spielnr.)'!$B$2:$C$97,2)","v":"Kurt Zebisch | Mr. Bean"}]
[{"$f":"Auslosung7!G3","v":19},{"$f":"Auslosung7!H3","v":"Kurt Zebisch | Mr. Bean"},{"$f":"IF(F3+G3>0,IF(H3=\"OK\",IF(G3<F3,G3,100+(G3-F3)),0),0)","v":0},null,null,null,0,{"$f":"IF(OR(F3>=15,G3>=15),\"OK\",\"Fehlende oder falsche EIngabe\")","v":"Fehlende oder falsche EIngabe"}]
[{"$f":"Auslosung7!G4","v":4},{"$f":"Auslosung7!H4","v":"Andi Krajic u Peter Doblander/Tarrenz"},{"$f":"IF(F5+G5>0,IF(H5=\"OK\",IF(F5<G5,F5,100+(F5-G5)),0),0)","v":0},null,null,{"$f":"VLOOKUP(A4,'Meldung (Reihung nach Spielnr.)'!$B$2:$C$97,2)","v":"Andi Krajic u Peter Doblander/Tarrenz"},{"$f":"VLOOKUP(A5,'Meldung (Reihung nach Spielnr.)'!$B$2:$C$97,2)","v":"Annette u Veronika/Telfs"}]
[{"$f":"Auslosung7!G5","v":2},{"$f":"Auslosung7!H5","v":"Annette u Veronika/Telfs"},{"$f":"IF(F5+G5>0,IF(H5=\"OK\",IF(G5<F5,G5,100+(G5-F5)),0),0)","v":0},null,null,null,0,{"$f":"IF(OR(F5>=15,G5>=15),\"OK\",\"Fehlende oder falsche EIngabe\")","v":"Fehlende oder falsche EIngabe"}]
[{"$f":"Auslosung7!G6","v":5},{"$f":"Auslosung7!H6","v":"Gerhard Schuler u Meinhard Eiter/Imst"},{"$f":"IF(F7+G7>0,IF(H7=\"OK\",IF(F7<G7,F7,100+(F7-G7)),0),0)","v":0},null,null,{"$f":"VLOOKUP(A6,'Meldung (Reihung nach Spielnr.)'!$B$2:$C$97,2)","v":"Gerhard Schuler u Meinhard Eiter/Imst"},{"$f":"VLOOKUP(A7,'Meldung (Reihung nach Spielnr.)'!$B$2:$C$97,2)","v":"Rudi Kastner u Peter Tschenett/Imst"}]
[{"$f":"Auslosung7!G7","v":9},{"$f":"Auslosung7!H7","v":"Rudi Kastner u Peter Tschenett/Imst"},{"$f":"IF(F7+G7>0,IF(H7=\"OK\",IF(G7<F7,G7,100+(G7-F7)),0),0)","v":0},null,null,null,null,{"$f":"IF(OR(F7>=15,G7>=15),\"OK\",\"Fehlende oder falsche EIngabe\")","v":"Fehlende oder falsche EIngabe"}]
[{"$f":"Auslosung7!G8","v":3},{"$f":"Auslosung7!H8","v":"Hubert Auer u Daniela Nöbauer/Telfs"},{"$f":"IF(F9+G9>0,IF(H9=\"OK\",IF(F9<G9,F9,100+(F9-G9)),0),0)","v":0},null,null,{"$f":"VLOOKUP(A8,'Meldung (Reihung nach Spielnr.)'!$B$2:$C$97,2)","v":"Hubert Auer u Daniela Nöbauer/Telfs"},{"$f":"VLOOKUP(A9,'Meldung (Reihung nach Spielnr.)'!$B$2:$C$97,2)","v":"Franz Pellegrini u Hans Matha/Südtirol"}]
[{"$f":"Auslosung7!G9","v":10},{"$f":"Auslosung7!H9","v":"Franz Pellegrini u Hans Matha/Südtirol"},{"$f":"IF(F9+G9>0,IF(H9=\"OK\",IF(G9<F9,G9,100+(G9-F9)),0),0)","v":0},null,null,null,null,{"$f":"IF(OR(F9>=15,G9>=15),\"OK\",\"Fehlende oder falsche EIngabe\")","v":"Fehlende oder falsche EIngabe"}]
[{"$f":"Auslosung7!G10","v":8},{"$f":"Auslosung7!H10","v":"Herbert Lechleitner u  Stefan Krabichler/Imst"},{"$f":"IF(F11+G11>0,IF(H11=\"OK\",IF(F11<G11,F11,100+(F11-G11)),0),0)","v":0},null,null,{"$f":"VLOOKUP(A10,'Meldung (Reihung nach Spielnr.)'!$B$2:$C$97,2)","v":"Herbert Lechleitner u  Stefan Krabichler/Imst"},{"$f":"VLOOKUP(A11,'Meldung (Reihung nach Spielnr.)'!$B$2:$C$97,2)","v":"Peter Auer u Stefan Sarg/Axams"}]
[{"$f":"Auslosung7!G11","v":13},{"$f":"Auslosung7!H11","v":"Peter Auer u Stefan Sarg/Axams"},{"$f":"IF(F11+G11>0,IF(H11=\"OK\",IF(G11<F11,G11,100+(G11-F11)),0),0)","v":0},null,null,null,0,{"$f":"IF(OR(F11>=15,G11>=15),\"OK\",\"Fehlende oder falsche EIngabe\")","v":"Fehlende oder falsche EIngabe"}]
[{"$f":"Auslosung7!G12","v":1},{"$f":"Auslosung7!H12","v":"Edi u Gerald/Telfs"},{"$f":"IF(F13+G13>0,IF(H13=\"OK\",IF(F13<G13,F13,100+(F13-G13)),0),0)","v":0},null,null,{"$f":"VLOOKUP(A12,'Meldung (Reihung nach Spielnr.)'!$B$2:$C$97,2)","v":"Edi u Gerald/Telfs"},{"$f":"VLOOKUP(A13,'Meldung (Reihung nach Spielnr.)'!$B$2:$C$97,2)","v":"Bernhard Meischberger u Martin Staggl/Kematen"}]
[{"$f":"Auslosung7!G13","v":15},{"$f":"Auslosung7!H13","v":"Bernhard Meischberger u Martin Staggl/Kematen"},{"$f":"IF(F13+G13>0,IF(H13=\"OK\",IF(G13<F13,G13,100+(G13-F13)),0),0)","v":0},null,null,null,0,{"$f":"IF(OR(F13>=15,G13>=15),\"OK\",\"Fehlende oder falsche EIngabe\")","v":"Fehlende oder falsche EIngabe"}]
[{"$f":"Auslosung7!G14","v":17},{"$f":"Auslosung7!H14","v":"Karin Logar u Rudolf Häusler/Kematen"},{"$f":"IF(F15+G15>0,IF(H15=\"OK\",IF(F15<G15,F15,100+(F15-G15)),0),0)","v":0},null,null,{"$f":"VLOOKUP(A14,'Meldung (Reihung nach Spielnr.)'!$B$2:$C$97,2)","v":"Karin Logar u Rudolf Häusler/Kematen"},{"$f":"VLOOKUP(A15,'Meldung (Reihung nach Spielnr.)'!$B$2:$C$97,2)","v":"Hansjörg Hell u Franz Braunegger/Axams"}]
[{"$f":"Auslosung7!G15","v":14},{"$f":"Auslosung7!H15","v":"Hansjörg Hell u Franz Braunegger/Axams"},{"$f":"IF(F15+G15>0,IF(H15=\"OK\",IF(G15<F15,G15,100+(G15-F15)),0),0)","v":0},null,null,null,0,{"$f":"IF(OR(F15>=15,G15>=15),\"OK\",\"Fehlende oder falsche EIngabe\")","v":"Fehlende oder falsche EIngabe"}]
[{"$f":"Auslosung7!G16","v":11},{"$f":"Auslosung7!H16","v":"Heini Gruber u Gottfried Geier/Südtirol"},{"$f":"IF(F17+G17>0,IF(H17=\"OK\",IF(F17<G17,F17,100+(F17-G17)),0),0)","v":0},null,null,{"$f":"VLOOKUP(A16,'Meldung (Reihung nach Spielnr.)'!$B$2:$C$97,2)","v":"Heini Gruber u Gottfried Geier/Südtirol"},{"$f":"VLOOKUP(A17,'Meldung (Reihung nach Spielnr.)'!$B$2:$C$97,2)","v":"Josef Eisenbeutl u Herbert Gamper/Imst"}]
[{"$f":"Auslosung7!G17","v":18},{"$f":"Auslosung7!H17","v":"Josef Eisenbeutl u Herbert Gamper/Imst"},{"$f":"IF(F17+G17>0,IF(H17=\"OK\",IF(G17<F17,G17,100+(G17-F17)),0),0)","v":0},null,null,null,0,{"$f":"IF(OR(F17>=15,G17>=15),\"OK\",\"Fehlende oder falsche EIngabe\")","v":"Fehlende oder falsche EIngabe"}]
[{"$f":"Auslosung7!G18","v":12},{"$f":"Auslosung7!H18","v":"Heinrich Ebner u Erich Peer/Südtirol"},{"$f":"IF(F19+G19>0,IF(H19=\"OK\",IF(F19<G19,F19,100+(F19-G19)),0),0)","v":0},null,null,{"$f":"VLOOKUP(A18,'Meldung (Reihung nach Spielnr.)'!$B$2:$C$97,2)","v":"Heinrich Ebner u Erich Peer/Südtirol"},{"$f":"VLOOKUP(A19,'Meldung (Reihung nach Spielnr.)'!$B$2:$C$97,2)","v":"Thomas Heltschl u Fredl Mungenast/Imst"}]
[{"$f":"Auslosung7!G19","v":7},{"$f":"Auslosung7!H19","v":"Thomas Heltschl u Fredl Mungenast/Imst"},{"$f":"IF(F19+G19>0,IF(H19=\"OK\",IF(G19<F19,G19,100+(G19-F19)),0),0)","v":0},null,null,null,null,{"$f":"IF(OR(F19>=15,G19>=15),\"OK\",\"Fehlende oder falsche EIngabe\")","v":"Fehlende oder falsche EIngabe"}]
[{"$f":"Auslosung7!G20","v":16},{"$f":"Auslosung7!H20","v":"Hermann Lechner u Andreas Oberacher/Kematen"},{"$f":"IF(F21+G21>0,IF(H21=\"OK\",IF(F21<G21,F21,100+(F21-G21)),0),0)","v":0},null,null,{"$f":"VLOOKUP(A20,'Meldung (Reihung nach Spielnr.)'!$B$2:$C$97,2)","v":"Hermann Lechner u Andreas Oberacher/Kematen"},{"$f":"VLOOKUP(A21,'Meldung (Reihung nach Spielnr.)'!$B$2:$C$97,2)","v":"Hans Perktold u Horst Friedl/Imst"}]
[{"$f":"Auslosung7!G21","v":6},{"$f":"Auslosung7!H21","v":"Hans Perktold u Horst Friedl/Imst"},{"$f":"IF(F21+G21>0,IF(H21=\"OK\",IF(G21<F21,G21,100+(G21-F21)),0),0)","v":0},null,null,null,null,{"$f":"IF(OR(F21>=15,G21>=15),\"OK\",\"Fehlende oder falsche EIngabe\")","v":"Fehlende oder falsche EIngabe"}]
[{"$f":"Auslosung7!G22","v":0},{"$f":"Auslosung7!H22","v":{"$error":"#N/A"}},{"$f":"IF(F23+G23>0,IF(H23=\"OK\",IF(F23<G23,F23,100+(F23-G23)),0),0)","v":0},null,null,{"$f":"VLOOKUP(A22,'Meldung (Reihung nach Spielnr.)'!$B$2:$C$97,2)","v":{"$error":"#N/A"}},{"$f":"VLOOKUP(A23,'Meldung (Reihung nach Spielnr.)'!$B$2:$C$97,2)","v":{"$error":"#N/A"}}]
[{"$f":"Auslosung7!G23","v":0},{"$f":"Auslosung7!H23","v":{"$error":"#N/A"}},{"$f":"IF(F23+G23>0,IF(H23=\"OK\",IF(G23<F23,G23,100+(G23-F23)),0),0)","v":0},null,null,null,0,{"$f":"IF(OR(F23>=15,G23>=15),\"OK\",\"Fehlende oder falsche EIngabe\")","v":"Fehlende oder falsche EIngabe"}]
[{"$f":"Auslosung7!G24","v":0},{"$f":"Auslosung7!H24","v":{"$error":"#N/A"}},{"$f":"IF(F25+G25>0,IF(H25=\"OK\",IF(F25<G25,F25,100+(F25-G25)),0),0)","v":0},null,null,{"$f":"VLOOKUP(A24,'Meldung (Reihung nach Spielnr.)'!$B$2:$C$97,2)","v":{"$error":"#N/A"}},{"$f":"VLOOKUP(A25,'Meldung (Reihung nach Spielnr.)'!$B$2:$C$97,2)","v":{"$error":"#N/A"}}]
[{"$f":"Auslosung7!G25","v":0},{"$f":"Auslosung7!H25","v":{"$error":"#N/A"}},{"$f":"IF(F25+G25>0,IF(H25=\"OK\",IF(G25<F25,G25,100+(G25-F25)),0),0)","v":0},null,null,null,0,{"$f":"IF(OR(F25>=15,G25>=15),\"OK\",\"Fehlende oder falsche EIngabe\")","v":"Fehlende oder falsche EIngabe"}]
[{"$f":"Auslosung7!G26","v":0},{"$f":"Auslosung7!H26","v":{"$error":"#N/A"}},{"$f":"IF(F27+G27>0,IF(H27=\"OK\",IF(F27<G27,F27,100+(F27-G27)),0),0)","v":0},null,null,{"$f":"VLOOKUP(A26,'Meldung (Reihung nach Spielnr.)'!$B$2:$C$97,2)","v":{"$error":"#N/A"}},{"$f":"VLOOKUP(A27,'Meldung (Reihung nach Spielnr.)'!$B$2:$C$97,2)","v":{"$error":"#N/A"}}]
[{"$f":"Auslosung7!G27","v":0},{"$f":"Auslosung7!H27","v":{"$error":"#N/A"}},{"$f":"IF(F27+G27>0,IF(H27=\"OK\",IF(G27<F27,G27,100+(G27-F27)),0),0)","v":0},null,null,null,0,{"$f":"IF(OR(F27>=15,G27>=15),\"OK\",\"Fehlende oder falsche EIngabe\")","v":"Fehlende oder falsche EIngabe"}]
[{"$f":"Auslosung7!G28","v":0},{"$f":"Auslosung7!H28","v":{"$error":"#N/A"}},{"$f":"IF(F29+G29>0,IF(H29=\"OK\",IF(F29<G29,F29,100+(F29-G29)),0),0)","v":0},null,null,{"$f":"VLOOKUP(A28,'Meldung (Reihung nach Spielnr.)'!$B$2:$C$97,2)","v":{"$error":"#N/A"}},{"$f":"VLOOKUP(A29,'Meldung (Reihung nach Spielnr.)'!$B$2:$C$97,2)","v":{"$error":"#N/A"}}]
[{"$f":"Auslosung7!G29","v":0},{"$f":"Auslosung7!H29","v":{"$error":"#N/A"}},{"$f":"IF(F29+G29>0,IF(H29=\"OK\",IF(G29<F29,G29,100+(G29-F29)),0),0)","v":0},null,null,null,0,{"$f":"IF(OR(F29>=15,G29>=15),\"OK\",\"Fehlende oder falsche EIngabe\")","v":"Fehlende oder falsche EIngabe"}]
[{"$f":"Auslosung7!G30","v":0},{"$f":"Auslosung7!H30","v":{"$error":"#N/A"}},{"$f":"IF(F31+G31>0,IF(H31=\"OK\",IF(F31<G31,F31,100+(F31-G31)),0),0)","v":0},null,null,{"$f":"VLOOKUP(A30,'Meldung (Reihung nach Spielnr.)'!$B$2:$C$97,2)","v":{"$error":"#N/A"}},{"$f":"VLOOKUP(A31,'Meldung (Reihung nach Spielnr.)'!$B$2:$C$97,2)","v":{"$error":"#N/A"}}]
[{"$f":"Auslosung7!G31","v":0},{"$f":"Auslosung7!H31","v":{"$error":"#N/A"}},{"$f":"IF(F31+G31>0,IF(H31=\"OK\",IF(G31<F31,G31,100+(G31-F31)),0),0)","v":0},null,null,null,0,{"$f":"IF(OR(F31>=15,G31>=15),\"OK\",\"Fehlende oder falsche EIngabe\")","v":"Fehlende oder falsche EIngabe"}]
[{"$f":"Auslosung7!G32","v":0},{"$f":"Auslosung7!H32","v":{"$error":"#N/A"}},{"$f":"IF(F33+G33>0,IF(H33=\"OK\",IF(F33<G33,F33,100+(F33-G33)),0),0)","v":0},null,null,{"$f":"VLOOKUP(A32,'Meldung (Reihung nach Spielnr.)'!$B$2:$C$97,2)","v":{"$error":"#N/A"}},{"$f":"VLOOKUP(A33,'Meldung (Reihung nach Spielnr.)'!$B$2:$C$97,2)","v":{"$error":"#N/A"}}]
[{"$f":"Auslosung7!G33","v":0},{"$f":"Auslosung7!H33","v":{"$error":"#N/A"}},{"$f":"IF(F33+G33>0,IF(H33=\"OK\",IF(G33<F33,G33,100+(G33-F33)),0),0)","v":0},null,null,null,0,{"$f":"IF(OR(F33>=15,G33>=15),\"OK\",\"Fehlende oder falsche EIngabe\")","v":"Fehlende oder falsche EIngabe"}]
[{"$f":"Auslosung7!G34","v":0},{"$f":"Auslosung7!H34","v":{"$error":"#N/A"}},{"$f":"IF(F35+G35>0,IF(H35=\"OK\",IF(F35<G35,F35,100+(F35-G35)),0),0)","v":0},null,null,{"$f":"VLOOKUP(A34,'Meldung (Reihung nach Spielnr.)'!$B$2:$C$97,2)","v":{"$error":"#N/A"}},{"$f":"VLOOKUP(A35,'Meldung (Reihung nach Spielnr.)'!$B$2:$C$97,2)","v":{"$error":"#N/A"}}]
[{"$f":"Auslosung7!G35","v":0},{"$f":"Auslosung7!H35","v":{"$error":"#N/A"}},{"$f":"IF(F35+G35>0,IF(H35=\"OK\",IF(G35<F35,G35,100+(G35-F35)),0),0)","v":0},null,null,null,0,{"$f":"IF(OR(F35>=15,G35>=15),\"OK\",\"Fehlende oder falsche EIngabe\")","v":"Fehlende oder falsche EIngabe"}]
[{"$f":"Auslosung7!G36","v":0},{"$f":"Auslosung7!H36","v":{"$error":"#N/A"}},{"$f":"IF(F37+G37>0,IF(H37=\"OK\",IF(F37<G37,F37,100+(F37-G37)),0),0)","v":0},null,null,{"$f":"VLOOKUP(A36,'Meldung (Reihung nach Spielnr.)'!$B$2:$C$97,2)","v":{"$error":"#N/A"}},{"$f":"VLOOKUP(A37,'Meldung (Reihung nach Spielnr.)'!$B$2:$C$97,2)","v":{"$error":"#N/A"}}]
[{"$f":"Auslosung7!G37","v":0},{"$f":"Auslosung7!H37","v":{"$error":"#N/A"}},{"$f":"IF(F37+G37>0,IF(H37=\"OK\",IF(G37<F37,G37,100+(G37-F37)),0),0)","v":0},null,null,null,0,{"$f":"IF(OR(F37>=15,G37>=15),\"OK\",\"Fehlende oder falsche EIngabe\")","v":"Fehlende oder falsche EIngabe"}]
[{"$f":"Auslosung7!G38","v":0},{"$f":"Auslosung7!H38","v":{"$error":"#N/A"}},{"$f":"IF(F39+G39>0,IF(H39=\"OK\",IF(F39<G39,F39,100+(F39-G39)),0),0)","v":0},null,null,{"$f":"VLOOKUP(A38,'Meldung (Reihung nach Spielnr.)'!$B$2:$C$97,2)","v":{"$error":"#N/A"}},{"$f":"VLOOKUP(A39,'Meldung (Reihung nach Spielnr.)'!$B$2:$C$97,2)","v":{"$error":"#N/A"}}]
[{"$f":"Auslosung7!G39","v":0},{"$f":"Auslosung7!H39","v":{"$error":"#N/A"}},{"$f":"IF(F39+G39>0,IF(H39=\"OK\",IF(G39<F39,G39,100+(G39-F39)),0),0)","v":0},null,null,null,0,{"$f":"IF(OR(F39>=15,G39>=15),\"OK\",\"Fehlende oder falsche EIngabe\")","v":"Fehlende oder falsche EIngabe"}]
[{"$f":"Auslosung7!G40","v":0},{"$f":"Auslosung7!H40","v":{"$error":"#N/A"}},{"$f":"IF(F41+G41>0,IF(H41=\"OK\",IF(F41<G41,F41,100+(F41-G41)),0),0)","v":0},null,null,{"$f":"VLOOKUP(A40,'Meldung (Reihung nach Spielnr.)'!$B$2:$C$97,2)","v":{"$error":"#N/A"}},{"$f":"VLOOKUP(A41,'Meldung (Reihung nach Spielnr.)'!$B$2:$C$97,2)","v":{"$error":"#N/A"}}]
[{"$f":"Auslosung7!G41","v":0},{"$f":"Auslosung7!H41","v":{"$error":"#N/A"}},{"$f":"IF(F41+G41>0,IF(H41=\"OK\",IF(G41<F41,G41,100+(G41-F41)),0),0)","v":0},null,null,null,0,{"$f":"IF(OR(F41>=15,G41>=15),\"OK\",\"Fehlende oder falsche EIngabe\")","v":"Fehlende oder falsche EIngabe"}]
[{"$f":"Auslosung7!G42","v":0},{"$f":"Auslosung7!H42","v":{"$error":"#N/A"}},{"$f":"IF(F43+G43>0,IF(H43=\"OK\",IF(F43<G43,F43,100+(F43-G43)),0),0)","v":0},null,null,{"$f":"VLOOKUP(A42,'Meldung (Reihung nach Spielnr.)'!$B$2:$C$97,2)","v":{"$error":"#N/A"}},{"$f":"VLOOKUP(A43,'Meldung (Reihung nach Spielnr.)'!$B$2:$C$97,2)","v":{"$error":"#N/A"}}]
[{"$f":"Auslosung7!G43","v":0},{"$f":"Auslosung7!H43","v":{"$error":"#N/A"}},{"$f":"IF(F43+G43>0,IF(H43=\"OK\",IF(G43<F43,G43,100+(G43-F43)),0),0)","v":0},null,null,null,0,{"$f":"IF(OR(F43>=15,G43>=15),\"OK\",\"Fehlende oder falsche EIngabe\")","v":"Fehlende oder falsche EIngabe"}]
[{"$f":"Auslosung7!G44","v":0},{"$f":"Auslosung7!H44","v":{"$error":"#N/A"}},{"$f":"IF(F45+G45>0,IF(H45=\"OK\",IF(F45<G45,F45,100+(F45-G45)),0),0)","v":0},null,null,{"$f":"VLOOKUP(A44,'Meldung (Reihung nach Spielnr.)'!$B$2:$C$97,2)","v":{"$error":"#N/A"}},{"$f":"VLOOKUP(A45,'Meldung (Reihung nach Spielnr.)'!$B$2:$C$97,2)","v":{"$error":"#N/A"}}]
[{"$f":"Auslosung7!G45","v":0},{"$f":"Auslosung7!H45","v":{"$error":"#N/A"}},{"$f":"IF(F45+G45>0,IF(H45=\"OK\",IF(G45<F45,G45,100+(G45-F45)),0),0)","v":0},null,null,null,0,{"$f":"IF(OR(F45>=15,G45>=15),\"OK\",\"Fehlende oder falsche EIngabe\")","v":"Fehlende oder falsche EIngabe"}]
[{"$f":"Auslosung7!G46","v":0},{"$f":"Auslosung7!H46","v":{"$error":"#N/A"}},{"$f":"IF(F47+G47>0,IF(H47=\"OK\",IF(F47<G47,F47,100+(F47-G47)),0),0)","v":0},null,null,{"$f":"VLOOKUP(A46,'Meldung (Reihung nach Spielnr.)'!$B$2:$C$97,2)","v":{"$error":"#N/A"}},{"$f":"VLOOKUP(A47,'Meldung (Reihung nach Spielnr.)'!$B$2:$C$97,2)","v":{"$error":"#N/A"}}]
[{"$f":"Auslosung7!G47","v":0},{"$f":"Auslosung7!H47","v":{"$error":"#N/A"}},{"$f":"IF(F47+G47>0,IF(H47=\"OK\",IF(G47<F47,G47,100+(G47-F47)),0),0)","v":0},null,null,null,0,{"$f":"IF(OR(F47>=15,G47>=15),\"OK\",\"Fehlende oder falsche EIngabe\")","v":"Fehlende oder falsche EIngabe"}]
[{"$f":"Auslosung7!G48","v":0},{"$f":"Auslosung7!H48","v":{"$error":"#N/A"}},{"$f":"IF(F49+G49>0,IF(H49=\"OK\",IF(F49<G49,F49,100+(F49-G49)),0),0)","v":0},null,null,{"$f":"VLOOKUP(A48,'Meldung (Reihung nach Spielnr.)'!$B$2:$C$97,2)","v":{"$error":"#N/A"}},{"$f":"VLOOKUP(A49,'Meldung (Reihung nach Spielnr.)'!$B$2:$C$97,2)","v":{"$error":"#N/A"}}]
[{"$f":"Auslosung7!G49","v":0},{"$f":"Auslosung7!H49","v":{"$error":"#N/A"}},{"$f":"IF(F49+G49>0,IF(H49=\"OK\",IF(G49<F49,G49,100+(G49-F49)),0),0)","v":0},null,null,null,0,{"$f":"IF(OR(F49>=15,G49>=15),\"OK\",\"Fehlende oder falsche EIngabe\")","v":"Fehlende oder falsche EIngabe"}]
[{"$f":"Auslosung7!G50","v":0},{"$f":"Auslosung7!H50","v":{"$error":"#N/A"}},{"$f":"IF(F51+G51>0,IF(H51=\"OK\",IF(F51<G51,F51,100+(F51-G51)),0),0)","v":0},null,null,{"$f":"VLOOKUP(A50,'Meldung (Reihung nach Spielnr.)'!$B$2:$C$97,2)","v":{"$error":"#N/A"}},{"$f":"VLOOKUP(A51,'Meldung (Reihung nach Spielnr.)'!$B$2:$C$97,2)","v":{"$error":"#N/A"}}]
[{"$f":"Auslosung7!G51","v":0},{"$f":"Auslosung7!H51","v":{"$error":"#N/A"}},{"$f":"IF(F51+G51>0,IF(H51=\"OK\",IF(G51<F51,G51,100+(G51-F51)),0),0)","v":0},null,null,null,0,{"$f":"IF(OR(F51>=15,G51>=15),\"OK\",\"Fehlende oder falsche EIngabe\")","v":"Fehlende oder falsche EIngabe"}]
[{"$f":"Auslosung7!G52","v":0},{"$f":"Auslosung7!H52","v":{"$error":"#N/A"}},{"$f":"IF(F53+G53>0,IF(H53=\"OK\",IF(F53<G53,F53,100+(F53-G53)),0),0)","v":0},null,null,{"$f":"VLOOKUP(A52,'Meldung (Reihung nach Spielnr.)'!$B$2:$C$97,2)","v":{"$error":"#N/A"}},{"$f":"VLOOKUP(A53,'Meldung (Reihung nach Spielnr.)'!$B$2:$C$97,2)","v":{"$error":"#N/A"}}]
[{"$f":"Auslosung7!G53","v":0},{"$f":"Auslosung7!H53","v":{"$error":"#N/A"}},{"$f":"IF(F53+G53>0,IF(H53=\"OK\",IF(G53<F53,G53,100+(G53-F53)),0),0)","v":0},null,null,null,0,{"$f":"IF(OR(F53>=15,G53>=15),\"OK\",\"Fehlende oder falsche EIngabe\")","v":"Fehlende oder falsche EIngabe"}]
[{"$f":"Auslosung7!G54","v":0},{"$f":"Auslosung7!H54","v":{"$error":"#N/A"}},{"$f":"IF(F55+G55>0,IF(H55=\"OK\",IF(F55<G55,F55,100+(F55-G55)),0),0)","v":0},null,null,{"$f":"VLOOKUP(A54,'Meldung (Reihung nach Spielnr.)'!$B$2:$C$97,2)","v":{"$error":"#N/A"}},{"$f":"VLOOKUP(A55,'Meldung (Reihung nach Spielnr.)'!$B$2:$C$97,2)","v":{"$error":"#N/A"}}]
[{"$f":"Auslosung7!G55","v":0},{"$f":"Auslosung7!H55","v":{"$error":"#N/A"}},{"$f":"IF(F55+G55>0,IF(H55=\"OK\",IF(G55<F55,G55,100+(G55-F55)),0),0)","v":0},null,null,null,0,{"$f":"IF(OR(F55>=15,G55>=15),\"OK\",\"Fehlende oder falsche EIngabe\")","v":"Fehlende oder falsche EIngabe"}]
[{"$f":"Auslosung7!G56","v":0},{"$f":"Auslosung7!H56","v":{"$error":"#N/A"}},{"$f":"IF(F57+G57>0,IF(H57=\"OK\",IF(F57<G57,F57,100+(F57-G57)),0),0)","v":0},null,null,{"$f":"VLOOKUP(A56,'Meldung (Reihung nach Spielnr.)'!$B$2:$C$97,2)","v":{"$error":"#N/A"}},{"$f":"VLOOKUP(A57,'Meldung (Reihung nach Spielnr.)'!$B$2:$C$97,2)","v":{"$error":"#N/A"}}]
[{"$f":"Auslosung7!G57","v":0},{"$f":"Auslosung7!H57","v":{"$error":"#N/A"}},{"$f":"IF(F57+G57>0,IF(H57=\"OK\",IF(G57<F57,G57,100+(G57-F57)),0),0)","v":0},null,null,null,0,{"$f":"IF(OR(F57>=15,G57>=15),\"OK\",\"Fehlende oder falsche EIngabe\")","v":"Fehlende oder falsche EIngabe"}]
[{"$f":"Auslosung7!G58","v":0},{"$f":"Auslosung7!H58","v":{"$error":"#N/A"}},{"$f":"IF(F59+G59>0,IF(H59=\"OK\",IF(F59<G59,F59,100+(F59-G59)),0),0)","v":0},null,null,{"$f":"VLOOKUP(A58,'Meldung (Reihung nach Spielnr.)'!$B$2:$C$97,2)","v":{"$error":"#N/A"}},{"$f":"VLOOKUP(A59,'Meldung (Reihung nach Spielnr.)'!$B$2:$C$97,2)","v":{"$error":"#N/A"}}]
[{"$f":"Auslosung7!G59","v":0},{"$f":"Auslosung7!H59","v":{"$error":"#N/A"}},{"$f":"IF(F59+G59>0,IF(H59=\"OK\",IF(G59<F59,G59,100+(G59-F59)),0),0)","v":0},null,null,null,0,{"$f":"IF(OR(F59>=15,G59>=15),\"OK\",\"Fehlende oder falsche EIngabe\")","v":"Fehlende oder falsche EIngabe"}]
[{"$f":"Auslosung7!G60","v":0},{"$f":"Auslosung7!H60","v":{"$error":"#N/A"}},{"$f":"IF(F61+G61>0,IF(H61=\"OK\",IF(F61<G61,F61,100+(F61-G61)),0),0)","v":0},null,null,{"$f":"VLOOKUP(A60,'Meldung (Reihung nach Spielnr.)'!$B$2:$C$97,2)","v":{"$error":"#N/A"}},{"$f":"VLOOKUP(A61,'Meldung (Reihung nach Spielnr.)'!$B$2:$C$97,2)","v":{"$error":"#N/A"}}]
[{"$f":"Auslosung7!G61","v":0},{"$f":"Auslosung7!H61","v":{"$error":"#N/A"}},{"$f":"IF(F61+G61>0,IF(H61=\"OK\",IF(G61<F61,G61,100+(G61-F61)),0),0)","v":0},null,null,null,0,{"$f":"IF(OR(F61>=15,G61>=15),\"OK\",\"Fehlende oder falsche EIngabe\")","v":"Fehlende oder falsche EIngabe"}]
[{"$f":"Auslosung7!G62","v":0},{"$f":"Auslosung7!H62","v":{"$error":"#N/A"}},{"$f":"IF(F63+G63>0,IF(H63=\"OK\",IF(F63<G63,F63,100+(F63-G63)),0),0)","v":0},null,null,{"$f":"VLOOKUP(A62,'Meldung (Reihung nach Spielnr.)'!$B$2:$C$97,2)","v":{"$error":"#N/A"}},{"$f":"VLOOKUP(A63,'Meldung (Reihung nach Spielnr.)'!$B$2:$C$97,2)","v":{"$error":"#N/A"}}]
[{"$f":"Auslosung7!G63","v":0},{"$f":"Auslosung7!H63","v":{"$error":"#N/A"}},{"$f":"IF(F63+G63>0,IF(H63=\"OK\",IF(G63<F63,G63,100+(G63-F63)),0),0)","v":0},null,null,null,0,{"$f":"IF(OR(F63>=15,G63>=15),\"OK\",\"Fehlende oder falsche EIngabe\")","v":"Fehlende oder falsche EIngabe"}]
[{"$f":"Auslosung7!G64","v":0},{"$f":"Auslosung7!H64","v":{"$error":"#N/A"}},{"$f":"IF(F65+G65>0,IF(H65=\"OK\",IF(F65<G65,F65,100+(F65-G65)),0),0)","v":0},null,null,{"$f":"VLOOKUP(A64,'Meldung (Reihung nach Spielnr.)'!$B$2:$C$97,2)","v":{"$error":"#N/A"}},{"$f":"VLOOKUP(A65,'Meldung (Reihung nach Spielnr.)'!$B$2:$C$97,2)","v":{"$error":"#N/A"}}]
[{"$f":"Auslosung7!G65","v":0},{"$f":"Auslosung7!H65","v":{"$error":"#N/A"}},{"$f":"IF(F65+G65>0,IF(H65=\"OK\",IF(G65<F65,G65,100+(G65-F65)),0),0)","v":0},null,null,null,0,{"$f":"IF(OR(F65>=15,G65>=15),\"OK\",\"Fehlende oder falsche EIngabe\")","v":"Fehlende oder falsche EIngabe"}]
[{"$f":"Auslosung7!G66","v":0},{"$f":"Auslosung7!H66","v":{"$error":"#N/A"}},{"$f":"IF(F67+G67>0,IF(H67=\"OK\",IF(F67<G67,F67,100+(F67-G67)),0),0)","v":0},null,null,{"$f":"VLOOKUP(A66,'Meldung (Reihung nach Spielnr.)'!$B$2:$C$97,2)","v":{"$error":"#N/A"}},{"$f":"VLOOKUP(A67,'Meldung (Reihung nach Spielnr.)'!$B$2:$C$97,2)","v":{"$error":"#N/A"}}]
[{"$f":"Auslosung7!G67","v":0},{"$f":"Auslosung7!H67","v":{"$error":"#N/A"}},{"$f":"IF(F67+G67>0,IF(H67=\"OK\",IF(G67<F67,G67,100+(G67-F67)),0),0)","v":0},null,null,null,0,{"$f":"IF(OR(F67>=15,G67>=15),\"OK\",\"Fehlende oder falsche EIngabe\")","v":"Fehlende oder falsche EIngabe"}]
[{"$f":"Auslosung7!G68","v":0},{"$f":"Auslosung7!H68","v":{"$error":"#N/A"}},{"$f":"IF(F69+G69>0,IF(H69=\"OK\",IF(F69<G69,F69,100+(F69-G69)),0),0)","v":0},null,null,{"$f":"VLOOKUP(A68,'Meldung (Reihung nach Spielnr.)'!$B$2:$C$97,2)","v":{"$error":"#N/A"}},{"$f":"VLOOKUP(A69,'Meldung (Reihung nach Spielnr.)'!$B$2:$C$97,2)","v":{"$error":"#N/A"}}]
[{"$f":"Auslosung7!G69","v":0},{"$f":"Auslosung7!H69","v":{"$error":"#N/A"}},{"$f":"IF(F69+G69>0,IF(H69=\"OK\",IF(G69<F69,G69,100+(G69-F69)),0),0)","v":0},null,null,null,0,{"$f":"IF(OR(F69>=15,G69>=15),\"OK\",\"Fehlende oder falsche EIngabe\")","v":"Fehlende oder falsche EIngabe"}]
[{"$f":"Auslosung7!G70","v":0},{"$f":"Auslosung7!H70","v":{"$error":"#N/A"}},{"$f":"IF(F71+G71>0,IF(H71=\"OK\",IF(F71<G71,F71,100+(F71-G71)),0),0)","v":0},null,null,{"$f":"VLOOKUP(A70,'Meldung (Reihung nach Spielnr.)'!$B$2:$C$97,2)","v":{"$error":"#N/A"}},{"$f":"VLOOKUP(A71,'Meldung (Reihung nach Spielnr.)'!$B$2:$C$97,2)","v":{"$error":"#N/A"}}]
[{"$f":"Auslosung7!G71","v":0},{"$f":"Auslosung7!H71","v":{"$error":"#N/A"}},{"$f":"IF(F71+G71>0,IF(H71=\"OK\",IF(G71<F71,G71,100+(G71-F71)),0),0)","v":0},null,null,null,0,{"$f":"IF(OR(F71>=15,G71>=15),\"OK\",\"Fehlende oder falsche EIngabe\")","v":"Fehlende oder falsche EIngabe"}]
[{"$f":"Auslosung7!G72","v":0},{"$f":"Auslosung7!H72","v":{"$error":"#N/A"}},{"$f":"IF(F73+G73>0,IF(H73=\"OK\",IF(F73<G73,F73,100+(F73-G73)),0),0)","v":0},null,null,{"$f":"VLOOKUP(A72,'Meldung (Reihung nach Spielnr.)'!$B$2:$C$97,2)","v":{"$error":"#N/A"}},{"$f":"VLOOKUP(A73,'Meldung (Reihung nach Spielnr.)'!$B$2:$C$97,2)","v":{"$error":"#N/A"}}]
[{"$f":"Auslosung7!G73","v":0},{"$f":"Auslosung7!H73","v":{"$error":"#N/A"}},{"$f":"IF(F73+G73>0,IF(H73=\"OK\",IF(G73<F73,G73,100+(G73-F73)),0),0)","v":0},null,null,null,0,{"$f":"IF(OR(F73>=15,G73>=15),\"OK\",\"Fehlende oder falsche EIngabe\")","v":"Fehlende oder falsche EIngabe"}]
[{"$f":"Auslosung7!G74","v":0},{"$f":"Auslosung7!H74","v":{"$error":"#N/A"}},{"$f":"IF(F75+G75>0,IF(H75=\"OK\",IF(F75<G75,F75,100+(F75-G75)),0),0)","v":0},null,null,{"$f":"VLOOKUP(A74,'Meldung (Reihung nach Spielnr.)'!$B$2:$C$97,2)","v":{"$error":"#N/A"}},{"$f":"VLOOKUP(A75,'Meldung (Reihung nach Spielnr.)'!$B$2:$C$97,2)","v":{"$error":"#N/A"}}]
[{"$f":"Auslosung7!G75","v":0},{"$f":"Auslosung7!H75","v":{"$error":"#N/A"}},{"$f":"IF(F75+G75>0,IF(H75=\"OK\",IF(G75<F75,G75,100+(G75-F75)),0),0)","v":0},null,null,null,0,{"$f":"IF(OR(F75>=15,G75>=15),\"OK\",\"Fehlende oder falsche EIngabe\")","v":"Fehlende oder falsche EIngabe"}]
[{"$f":"Auslosung7!G76","v":0},{"$f":"Auslosung7!H76","v":{"$error":"#N/A"}},{"$f":"IF(F77+G77>0,IF(H77=\"OK\",IF(F77<G77,F77,100+(F77-G77)),0),0)","v":0},null,null,{"$f":"VLOOKUP(A76,'Meldung (Reihung nach Spielnr.)'!$B$2:$C$97,2)","v":{"$error":"#N/A"}},{"$f":"VLOOKUP(A77,'Meldung (Reihung nach Spielnr.)'!$B$2:$C$97,2)","v":{"$error":"#N/A"}}]
[{"$f":"Auslosung7!G77","v":0},{"$f":"Auslosung7!H77","v":{"$error":"#N/A"}},{"$f":"IF(F77+G77>0,IF(H77=\"OK\",IF(G77<F77,G77,100+(G77-F77)),0),0)","v":0},null,null,null,0,{"$f":"IF(OR(F77>=15,G77>=15),\"OK\",\"Fehlende oder falsche EIngabe\")","v":"Fehlende oder falsche EIngabe"}]
[{"$f":"Auslosung7!G78","v":0},{"$f":"Auslosung7!H78","v":{"$error":"#N/A"}},{"$f":"IF(F79+G79>0,IF(H79=\"OK\",IF(F79<G79,F79,100+(F79-G79)),0),0)","v":0},null,null,{"$f":"VLOOKUP(A78,'Meldung (Reihung nach Spielnr.)'!$B$2:$C$97,2)","v":{"$error":"#N/A"}},{"$f":"VLOOKUP(A79,'Meldung (Reihung nach Spielnr.)'!$B$2:$C$97,2)","v":{"$error":"#N/A"}}]
[{"$f":"Auslosung7!G79","v":0},{"$f":"Auslosung7!H79","v":{"$error":"#N/A"}},{"$f":"IF(F79+G79>0,IF(H79=\"OK\",IF(G79<F79,G79,100+(G79-F79)),0),0)","v":0},null,null,null,0,{"$f":"IF(OR(F79>=15,G79>=15),\"OK\",\"Fehlende oder falsche EIngabe\")","v":"Fehlende oder falsche EIngabe"}]
[{"$f":"Auslosung7!G80","v":0},{"$f":"Auslosung7!H80","v":{"$error":"#N/A"}},{"$f":"IF(F81+G81>0,IF(H81=\"OK\",IF(F81<G81,F81,100+(F81-G81)),0),0)","v":0},null,null,{"$f":"VLOOKUP(A80,'Meldung (Reihung nach Spielnr.)'!$B$2:$C$97,2)","v":{"$error":"#N/A"}},{"$f":"VLOOKUP(A81,'Meldung (Reihung nach Spielnr.)'!$B$2:$C$97,2)","v":{"$error":"#N/A"}}]
[{"$f":"Auslosung7!G81","v":0},{"$f":"Auslosung7!H81","v":{"$error":"#N/A"}},{"$f":"IF(F81+G81>0,IF(H81=\"OK\",IF(G81<F81,G81,100+(G81-F81)),0),0)","v":0},null,null,null,0,{"$f":"IF(OR(F81>=15,G81>=15),\"OK\",\"Fehlende oder falsche EIngabe\")","v":"Fehlende oder falsche EIngabe"}]
[{"$f":"Auslosung7!G82","v":0},{"$f":"Auslosung7!H82","v":{"$error":"#N/A"}},{"$f":"IF(F83+G83>0,IF(H83=\"OK\",IF(F83<G83,F83,100+(F83-G83)),0),0)","v":0},null,null,{"$f":"VLOOKUP(A82,'Meldung (Reihung nach Spielnr.)'!$B$2:$C$97,2)","v":{"$error":"#N/A"}},{"$f":"VLOOKUP(A83,'Meldung (Reihung nach Spielnr.)'!$B$2:$C$97,2)","v":{"$error":"#N/A"}}]
[{"$f":"Auslosung7!G83","v":0},{"$f":"Auslosung7!H83","v":{"$error":"#N/A"}},{"$f":"IF(F83+G83>0,IF(H83=\"OK\",IF(G83<F83,G83,100+(G83-F83)),0),0)","v":0},null,null,null,0,{"$f":"IF(OR(F83>=15,G83>=15),\"OK\",\"Fehlende oder falsche EIngabe\")","v":"Fehlende oder falsche EIngabe"}]
[{"$f":"Auslosung7!G84","v":0},{"$f":"Auslosung7!H84","v":{"$error":"#N/A"}},{"$f":"IF(F85+G85>0,IF(H85=\"OK\",IF(F85<G85,F85,100+(F85-G85)),0),0)","v":0},null,null,{"$f":"VLOOKUP(A84,'Meldung (Reihung nach Spielnr.)'!$B$2:$C$97,2)","v":{"$error":"#N/A"}},{"$f":"VLOOKUP(A85,'Meldung (Reihung nach Spielnr.)'!$B$2:$C$97,2)","v":{"$error":"#N/A"}}]
[{"$f":"Auslosung7!G85","v":0},{"$f":"Auslosung7!H85","v":{"$error":"#N/A"}},{"$f":"IF(F85+G85>0,IF(H85=\"OK\",IF(G85<F85,G85,100+(G85-F85)),0),0)","v":0},null,null,null,0,{"$f":"IF(OR(F85>=15,G85>=15),\"OK\",\"Fehlende oder falsche EIngabe\")","v":"Fehlende oder falsche EIngabe"}]
[{"$f":"Auslosung7!G86","v":0},{"$f":"Auslosung7!H86","v":{"$error":"#N/A"}},{"$f":"IF(F87+G87>0,IF(H87=\"OK\",IF(F87<G87,F87,100+(F87-G87)),0),0)","v":0},null,null,{"$f":"VLOOKUP(A86,'Meldung (Reihung nach Spielnr.)'!$B$2:$C$97,2)","v":{"$error":"#N/A"}},{"$f":"VLOOKUP(A87,'Meldung (Reihung nach Spielnr.)'!$B$2:$C$97,2)","v":{"$error":"#N/A"}}]
[{"$f":"Auslosung7!G87","v":0},{"$f":"Auslosung7!H87","v":{"$error":"#N/A"}},{"$f":"IF(F87+G87>0,IF(H87=\"OK\",IF(G87<F87,G87,100+(G87-F87)),0),0)","v":0},null,null,null,0,{"$f":"IF(OR(F87>=15,G87>=15),\"OK\",\"Fehlende oder falsche EIngabe\")","v":"Fehlende oder falsche EIngabe"}]
[{"$f":"Auslosung7!G88","v":0},{"$f":"Auslosung7!H88","v":{"$error":"#N/A"}},{"$f":"IF(F89+G89>0,IF(H89=\"OK\",IF(F89<G89,F89,100+(F89-G89)),0),0)","v":0},null,null,{"$f":"VLOOKUP(A88,'Meldung (Reihung nach Spielnr.)'!$B$2:$C$97,2)","v":{"$error":"#N/A"}},{"$f":"VLOOKUP(A89,'Meldung (Reihung nach Spielnr.)'!$B$2:$C$97,2)","v":{"$error":"#N/A"}}]
[{"$f":"Auslosung7!G89","v":0},{"$f":"Auslosung7!H89","v":{"$error":"#N/A"}},{"$f":"IF(F89+G89>0,IF(H89=\"OK\",IF(G89<F89,G89,100+(G89-F89)),0),0)","v":0},null,null,null,0,{"$f":"IF(OR(F89>=15,G89>=15),\"OK\",\"Fehlende oder falsche EIngabe\")","v":"Fehlende oder falsche EIngabe"}]
[{"$f":"Auslosung7!G90","v":0},{"$f":"Auslosung7!H90","v":{"$error":"#N/A"}},{"$f":"IF(F91+G91>0,IF(H91=\"OK\",IF(F91<G91,F91,100+(F91-G91)),0),0)","v":0},null,null,{"$f":"VLOOKUP(A90,'Meldung (Reihung nach Spielnr.)'!$B$2:$C$97,2)","v":{"$error":"#N/A"}},{"$f":"VLOOKUP(A91,'Meldung (Reihung nach Spielnr.)'!$B$2:$C$97,2)","v":{"$error":"#N/A"}}]
[{"$f":"Auslosung7!G91","v":0},{"$f":"Auslosung7!H91","v":{"$error":"#N/A"}},{"$f":"IF(F91+G91>0,IF(H91=\"OK\",IF(G91<F91,G91,100+(G91-F91)),0),0)","v":0},null,null,null,0,{"$f":"IF(OR(F91>=15,G91>=15),\"OK\",\"Fehlende oder falsche EIngabe\")","v":"Fehlende oder falsche EIngabe"}]
[{"$f":"Auslosung7!G92","v":0},{"$f":"Auslosung7!H92","v":{"$error":"#N/A"}},{"$f":"IF(F93+G93>0,IF(H93=\"OK\",IF(F93<G93,F93,100+(F93-G93)),0),0)","v":0},null,null,{"$f":"VLOOKUP(A92,'Meldung (Reihung nach Spielnr.)'!$B$2:$C$97,2)","v":{"$error":"#N/A"}},{"$f":"VLOOKUP(A93,'Meldung (Reihung nach Spielnr.)'!$B$2:$C$97,2)","v":{"$error":"#N/A"}}]
[{"$f":"Auslosung7!G93","v":0},{"$f":"Auslosung7!H93","v":{"$error":"#N/A"}},{"$f":"IF(F93+G93>0,IF(H93=\"OK\",IF(G93<F93,G93,100+(G93-F93)),0),0)","v":0},null,null,null,0,{"$f":"IF(OR(F93>=15,G93>=15),\"OK\",\"Fehlende oder falsche EIngabe\")","v":"Fehlende oder falsche EIngabe"}]
[{"$f":"Auslosung7!G94","v":0},{"$f":"Auslosung7!H94","v":{"$error":"#N/A"}},{"$f":"IF(F95+G95>0,IF(H95=\"OK\",IF(F95<G95,F95,100+(F95-G95)),0),0)","v":0},null,null,{"$f":"VLOOKUP(A94,'Meldung (Reihung nach Spielnr.)'!$B$2:$C$97,2)","v":{"$error":"#N/A"}},{"$f":"VLOOKUP(A95,'Meldung (Reihung nach Spielnr.)'!$B$2:$C$97,2)","v":{"$error":"#N/A"}}]
[{"$f":"Auslosung7!G95","v":0},{"$f":"Auslosung7!H95","v":{"$error":"#N/A"}},{"$f":"IF(F95+G95>0,IF(H95=\"OK\",IF(G95<F95,G95,100+(G95-F95)),0),0)","v":0},null,null,null,0,{"$f":"IF(OR(F95>=15,G95>=15),\"OK\",\"Fehlende oder falsche EIngabe\")","v":"Fehlende oder falsche EIngabe"}]
[{"$f":"Auslosung7!G96","v":0},{"$f":"Auslosung7!H96","v":{"$error":"#N/A"}},{"$f":"IF(F97+G97>0,IF(H97=\"OK\",IF(F97<G97,F97,100+(F97-G97)),0),0)","v":1},null,null,{"$f":"VLOOKUP(A96,'Meldung (Reihung nach Spielnr.)'!$B$2:$C$97,2)","v":{"$error":"#N/A"}},{"$f":"VLOOKUP(A97,'Meldung (Reihung nach Spielnr.)'!$B$2:$C$97,2)","v":{"$error":"#N/A"}}]
[{"$f":"Auslosung7!G97","v":0},{"$f":"Auslosung7!H97","v":{"$error":"#N/A"}},{"$f":"IF(F97+G97>0,IF(H97=\"OK\",IF(G97<F97,G97,100+(G97-F97)),0),0)","v":114},null,null,1,15,{"$f":"IF(OR(F97>=15,G97>=15),\"OK\",\"Fehlende oder falsche EIngabe\")","v":"OK"}]

{"sheet":"Hinweis","index":16,"n_rows":3,"n_cols":3,"rows_kept":3,"cut":false,"hidden":false,"merged":[]}
[]
[]
[null,"Hinweis: ","Achtung, damit die Sortierung der Ergebnisse aktualisiert wird, auf den Filter wie unten dargestellt klicken und einfach nochmals auf \"Nach Größe sortieren (absteigend)\" klicken - siehe Pfeil!"]