{"text_format":"1","workbook":"xlsx","n_sheets":17,"sheets":["Ergebnis","Meldung (Reihung nach Spielnr.)","Auslosung1","Runde 1","Auslosung2","Runde 2","Auslosung3","Runde 3","Auslosung4","Runde 4","Auslosung5","Runde 5","Auslosung6","Runde 6","Auslosung7","Runde 7","Hinweis"],"not_rendered":{"charts":0,"images":3,"macros":1,"external_links":0,"defined_names":102,"comments":0,"pivot_tables":0},"unopened":[],"bounds":{"document_bytes":16777216,"sheet_cells":100000,"rows_first":2000,"rows_last":500,"rows_between":2000,"halvings":0,"cell_chars":16384,"cell_head_chars":4096},"cells_cut":0,"cells_raw":0,"read":"whole","date_system":"1900"}

{"sheet":"Ergebnis","index":0,"n_rows":97,"n_cols":12,"rows_kept":97,"cut":false,"hidden":false,"merged":[]}
["Platz","Paar Nr","Name","Punkte",null,"RANG",null,null,{"$f":"COUNTIF(C2:C97,\"*\")","v":40},"Spieler",null,"Powered by:"]
[1,{"$f":"'Meldung (Reihung nach Spielnr.)'!B4","v":3},{"$f":"'Meldung (Reihung nach Spielnr.)'!C4","v":"Hubert Auer u Daniela Nöbauer/Telfs"},{"$f":"'Meldung (Reihung nach Spielnr.)'!K4","v":0},null,{"$f":"RANK(D2,D$2:D$21)","v":5}," ",null,"RANG(D2;D$2:D$41)"]
[2,{"$f":"'Meldung (Reihung nach Spielnr.)'!B5","v":4},{"$f":"'Meldung (Reihung nach Spielnr.)'!C5","v":"Andi Krajic u Peter Doblander/Tarrenz"},{"$f":"'Meldung (Reihung nach Spielnr.)'!K5","v":0},null,{"$f":"RANK(D3,D$2:D$21)","v":5}," ",null,"bei mehr Spielern Formel anpassen"]
[3,{"$f":"'Meldung (Reihung nach Spielnr.)'!B6","v":5},{"$f":"'Meldung (Reihung nach Spielnr.)'!C6","v":"Gerhard Schuler u Meinhard Eiter/Imst"},{"$f":"'Meldung (Reihung nach Spielnr.)'!K6","v":0},null,5]
[4,{"$f":"'Meldung (Reihung nach Spielnr.)'!B7","v":6},{"$f":"'Meldung (Reihung nach Spielnr.)'!C7","v":"Hans Perktold u Horst Friedl/Imst"},{"$f":"'Meldung (Reihung nach Spielnr.)'!K7","v":0},null,5,null,null,null,null,null,"Mag. Martin Weinfurtner"]
[5,{"$f":"'Meldung (Reihung nach Spielnr.)'!B9","v":8},{"$f":"'Meldung (Reihung nach Spielnr.)'!C9","v":"Herbert Lechleitner u  Stefan Krabichler/Imst"},{"$f":"'Meldung (Reihung nach Spielnr.)'!K9","v":0},null,5]
{"$rows_left_out":92}
{"sheet":"Meldung (Reihung nach Spielnr.)","index":1,"n_rows":97,"n_cols":25,"rows_kept":97,"cut":false,"hidden":false,"merged":[]}
[{"$f":"COUNTIF(C2:C97,\"*\")","v":40},"Paarnummer","Namen","Runde 1","Runde 2","Runde 3","Runde 4","Runde 5","Runde 6","Runde 7","Ges.","RANG",20,null,null,null,null,null,"ANZAHL:",{"$f":"COUNTIF(C2:C100,\"*\")","v":40},null,null,null,null,"Powered by:"]
[null,1,"Edi u Gerald/Telfs",{"$f":"VLOOKUP($B2,'Runde 1'!$A$2:$C$97,3,0)","v":0},{"$f":"VLOOKUP($B2,'Runde 2'!$A$2:$C$97,3,0)","v":0},{"$f":"VLOOKUP($B2,'Runde 3'!$A$2:$C$97,3,0)","v":0},{"$f":"VLOOKUP($B2,'Runde 4'!$A$2:$C$97,3,0)","v":3},{"$f":"VLOOKUP($B2,'Runde 5'!$A$2:$C$97,3,0)","v":0},{"$f":"VLOOKUP($B2,'Runde 6'!$A$2:$C$97,3,0)","v":0},{"$f":"VLOOKUP($B2,'Runde 7'!$A$2:$C$97,3,0)","v":0},{"$f":"SUM(D2:J2)","v":3},{"$f":"RANK(K2,K$2:K$21)","v":3}," ","RANG(M2;M$2:M20)"]
[null,2,"Annette u Veronika/Telfs",{"$f":"VLOOKUP($B3,'Runde 1'!$A$2:$C$97,3,0)","v":112},{"$f":"VLOOKUP($B3,'Runde 2'!$A$2:$C$97,3,0)","v":0},{"$f":"VLOOKUP($B3,'Runde 3'!$A$2:$C$97,3,0)","v":0},{"$f":"VLOOKUP($B3,'Runde 4'!$A$2:$C$97,3,0)","v":0},{"$f":"VLOOKUP($B3,'Runde 5'!$A$2:$C$97,3,0)","v":0},{"$f":"VLOOKUP($B3,'Runde 6'!$A$2:$C$97,3,0)","v":0},{"$f":"VLOOKUP($B3,'Runde 7'!$A$2:$C$97,3,0)","v":0},{"$f":"SUM(D3:J3)","v":112},{"$f":"RANK(K3,K$2:K$21)","v":1},null,"Formel nach Tischen anpassen"]
[null,3,"Hubert Auer u Daniela Nöbauer/Telfs",{"$f":"VLOOKUP($B4,'Runde 1'!$A$2:$C$97,3,0)","v":0},{"$f":"VLOOKUP($B4,'Runde 2'!$A$2:$C$97,3,0)","v":0},{"$f":"VLOOKUP($B4,'Runde 3'!$A$2:$C$97,3,0)","v":0},{"$f":"VLOOKUP($B4,'Runde 4'!$A$2:$C$97,3,0)","v":0},{"$f":"VLOOKUP($B4,'Runde 5'!$A$2:$C$97,3,0)","v":0},{"$f":"VLOOKUP($B4,'Runde 6'!$A$2:$C$97,3,0)","v":0},{"$f":"VLOOKUP($B4,'Runde 7'!$A$2:$C$97,3,0)","v":0},0,5]
[null,4,"Andi Krajic u Peter Doblander/Tarrenz",{"$f":"VLOOKUP($B5,'Runde 1'!$A$2:$C$97,3,0)","v":0},{"$f":"VLOOKUP($B5,'Runde 2'!$A$2:$C$97,3,0)","v":0},{"$f":"VLOOKUP($B5,'Runde 3'!$A$2:$C$97,3,0)","v":0},{"$f":"VLOOKUP($B5,'Runde 4'!$A$2:$C$97,3,0)","v":0},{"$f":"VLOOKUP($B5,'Runde 5'!$A$2:$C$97,3,0)","v":0},{"$f":"VLOOKUP($B5,'Runde 6'!$A$2:$C$97,3,0)","v":0},{"$f":"VLOOKUP($B5,'Runde 7'!$A$2:$C$97,3,0)","v":0},0,5]
[null,5,"Gerhard Schuler u Meinhard Eiter/Imst",{"$f":"VLOOKUP($B6,'Runde 1'!$A$2:$C$97,3,0)","v":0},{"$f":"VLOOKUP($B6,'Runde 2'!$A$2:$C$97,3,0)","v":0},{"$f":"VLOOKUP($B6,'Runde 3'!$A$2:$C$97,3,0)","v":0},{"$f":"VLOOKUP($B6,'Runde 4'!$A$2:$C$97,3,0)","v":0},{"$f":"VLOOKUP($B6,'Runde 5'!$A$2:$C$97,3,0)","v":0},{"$f":"VLOOKUP($B6,'Runde 6'!$A$2:$C$97,3,0)","v":0},{"$f":"VLOOKUP($B6,'Runde 7'!$A$2:$C$97,3,0)","v":0},0,5]
{"$rows_left_out":92}
{"sheet":"Auslosung1","index":2,"n_rows":97,"n_cols":8,"rows_kept":97,"cut":false,"hidden":false,"merged":[]}
[2,"UNTEN evt. Anzahl der Mannschaften korrigieren",null,null,"Zahl","TISCH","Mannschaft Nr.","Name"]
[7,20,null,null,1,1,{"$f":"A1","v":2},{"$f":"VLOOKUP(A1,'Meldung (Reihung nach Spielnr.)'!$B$2:$C$97,2)","v":"Annette u Veronika/Telfs"}]
[16,null,null,null,2,1,{"$f":"A2","v":7},{"$f":"VLOOKUP(A2,'Meldung (Reihung nach Spielnr.)'!$B$2:$C$97,2)","v":"Thomas Heltschl u Fredl Mungenast/Imst"}]
[4,null,null,null,3,2,16,{"$f":"VLOOKUP(A3,'Meldung (Reihung nach Spielnr.)'!$B$2:$C$97,2)","v":"Hermann Lechner u Andreas Oberacher/Kematen"}]
[1,null,null,null,4,2,4,{"$f":"VLOOKUP(A4,'Meldung (Reihung nach Spielnr.)'!$B$2:$C$97,2)","v":"Andi Krajic u Peter Doblander/Tarrenz"}]
[8,null,null,null,5,3,1,{"$f":"VLOOKUP(A5,'Meldung (Reihung nach Spielnr.)'!$B$2:$C$97,2)","v":"Edi u Gerald/Telfs"}]
{"$rows_left_out":92}
{"sheet":"Runde 1","index":3,"n_rows":99,"n_cols":8,"rows_kept":99,"cut":false,"hidden":false,"merged":[]}
["Spielernr.","Name","Runde 1","Teiln.:",{"$f":"Auslosung1!B2","v":20},"Mannschaft",null,15]
[{"$f":"Auslosung1!G2","v":2},{"$f":"Auslosung1!H2","v":"Annette u Veronika/Telfs"},{"$f":"IF(F3+G3>0,IF(H3=\"OK\",IF(F3<G3,F3,100+(F3-G3)),0),0)","v":112},null,null,{"$f":"VLOOKUP(A2,'Meldung (Reihung nach Spielnr.)'!$B$2:$C$97,2)","v":"Annette u Veronika/Telfs"},{"$f":"VLOOKUP(A3,'Meldung (Reihung nach Spielnr.)'!$B$2:$C$97,2)","v":"Thomas Heltschl u Fredl Mungenast/Imst"}]
[{"$f":"Auslosung1!G3","v":7},{"$f":"Auslosung1!H3","v":"Thomas Heltschl u Fredl Mungenast/Imst"},{"$f":"IF(F3+G3>0,IF(H3=\"OK\",IF(G3<F3,G3,100+(G3-F3)),0),0)","v":3},null,null,15,3,{"$f":"IF(OR(F3>=15,G3>=15),\"OK\",\"Fehlende oder falsche EIngabe\")","v":"OK"}]
[{"$f":"Auslosung1!G4","v":16},{"$f":"Auslosung1!H4","v":"Hermann Lechner u Andreas Oberacher/Kematen"},{"$f":"IF(F5+G5>0,IF(H5=\"OK\",IF(F5<G5,F5,100+(F5-G5)),0),0)","v":0},null,null,{"$f":"VLOOKUP(A4,'Meldung (Reihung nach Spielnr.)'!$B$2:$C$97,2)","v":"Hermann Lechner u Andreas Oberacher/Kematen"},{"$f":"VLOOKUP(A5,'Meldung (Reihung nach Spielnr.)'!$B$2:$C$97,2)","v":"Andi Krajic u Peter Doblander/Tarrenz"}]
[{"$f":"Auslosung1!G5","v":4},{"$f":"Auslosung1!H5","v":"Andi Krajic u Peter Doblander/Tarrenz"},{"$f":"IF(F5+G5>0,IF(H5=\"OK\",IF(G5<F5,G5,100+(G5-F5)),0),0)","v":0},null,null,null,null,{"$f":"IF(OR(F5>=15,G5>=15),\"OK\",\"Fehlende oder falsche EIngabe\")","v":"Fehlende oder falsche EIngabe"}]
[{"$f":"Auslosung1!G6","v":1},{"$f":"Auslosung1!H6","v":"Edi u Gerald/Telfs"},{"$f":"IF(F7+G7>0,IF(H7=\"OK\",IF(F7<G7,F7,100+(F7-G7)),0),0)","v":0},null,null,{"$f":"VLOOKUP(A6,'Meldung (Reihung nach Spielnr.)'!$B$2:$C$97,2)","v":"Edi u Gerald/Telfs"},{"$f":"VLOOKUP(A7,'Meldung (Reihung nach Spielnr.)'!$B$2:$C$97,2)","v":"Herbert Lechleitner u  Stefan Krabichler/Imst"}]
{"$rows_left_out":94}
{"sheet":"Auslosung2","index":4,"n_rows":98,"n_cols":8,"rows_kept":98,"cut":false,"hidden":false,"merged":[]}
[12,"Geben Sie in die grüne Zelle, die Anzahl der Paare ein",null,null,"Zahl","TISCH","Spieler Nr.","Name"]
[4,20,null,null,1,1,{"$f":"A1","v":12},{"$f":"VLOOKUP(A1,'Meldung (Reihung nach Spielnr.)'!$B$2:$C$97,2)","v":"Heinrich Ebner u Erich Peer/Südtirol"}]
[1,null,null,null,2,1,{"$f":"A2","v":4},{"$f":"VLOOKUP(A2,'Meldung (Reihung nach Spielnr.)'!$B$2:$C$97,2)","v":"Andi Krajic u Peter Doblander/Tarrenz"}]
[20,null,null,null,3,2,1,{"$f":"VLOOKUP(A3,'Meldung (Reihung nach Spielnr.)'!$B$2:$C$97,2)","v":"Edi u Gerald/Telfs"}]
[11,null,null,null,4,2,20,{"$f":"VLOOKUP(A4,'Meldung (Reihung nach Spielnr.)'!$B$2:$C$97,2)","v":"Krissmer Reinhard | Fringer Fred"}]
[6,null,null,null,5,3,11,{"$f":"VLOOKUP(A5,'Meldung (Reihung nach Spielnr.)'!$B$2:$C$97,2)","v":"Heini Gruber u Gottfried Geier/Südtirol"}]
{"$rows_left_out":93}
{"sheet":"Runde 2","index":5,"n_rows":97,"n_cols":8,"rows_kept":97,"cut":false,"hidden":false,"merged":[[0,3,0,4]]}
["Spielernr.","Name","Runde 2",null,null,"Punkte","Punkte",15]
[{"$f":"Auslosung2!G2","v":12},{"$f":"Auslosung2!H2","v":"Heinrich Ebner u Erich Peer/Südtirol"},{"$f":"IF(F3+G3>0,IF(H3=\"OK\",IF(F3<G3,F3,100+(F3-G3)),0),0)","v":0},null,null,{"$f":"VLOOKUP(A2,'Meldung (Reihung nach Spielnr.)'!$B$2:$C$97,2)","v":"Heinrich Ebner u Erich Peer/Südtirol"},{"$f":"VLOOKUP(A3,'Meldung (Reihung nach Spielnr.)'!$B$2:$C$97,2)","v":"Andi Krajic u Peter Doblander/Tarrenz"}]
[{"$f":"Auslosung2!G3","v":4},{"$f":"Auslosung2!H3","v":"Andi Krajic u Peter Doblander/Tarrenz"},{"$f":"IF(F3+G3>0,IF(H3=\"OK\",IF(G3<F3,G3,100+(G3-F3)),0),0)","v":0},null,null,null,null,{"$f":"IF(OR(F3>=15,G3>=15),\"OK\",\"Fehlende oder falsche EIngabe\")","v":"Fehlende oder falsche EIngabe"}]
[{"$f":"Auslosung2!G4","v":1},{"$f":"Auslosung2!H4","v":"Edi u Gerald/Telfs"},{"$f":"IF(F5+G5>0,IF(H5=\"OK\",IF(F5<G5,F5,100+(F5-G5)),0),0)","v":0},null,null,{"$f":"VLOOKUP(A4,'Meldung (Reihung nach Spielnr.)'!$B$2:$C$97,2)","v":"Edi u Gerald/Telfs"},{"$f":"VLOOKUP(A5,'Meldung (Reihung nach Spielnr.)'!$B$2:$C$97,2)","v":"Krissmer Reinhard | Fringer Fred"}]
[{"$f":"Auslosung2!G5","v":20},{"$f":"Auslosung2!H5","v":"Krissmer Reinhard | Fringer Fred"},{"$f":"IF(F5+G5>0,IF(H5=\"OK\",IF(G5<F5,G5,100+(G5-F5)),0),0)","v":0},null,null,null,null,{"$f":"IF(OR(F5>=15,G5>=15),\"OK\",\"Fehlende oder falsche EIngabe\")","v":"Fehlende oder falsche EIngabe"}]
[{"$f":"Auslosung2!G6","v":11},{"$f":"Auslosung2!H6","v":"Heini Gruber u Gottfried Geier/Südtirol"},{"$f":"IF(F7+G7>0,IF(H7=\"OK\",IF(F7<G7,F7,100+(F7-G7)),0),0)","v":0},null,null,{"$f":"VLOOKUP(A6,'Meldung (Reihung nach Spielnr.)'!$B$2:$C$97,2)","v":"Heini Gruber u Gottfried Geier/Südtirol"},{"$f":"VLOOKUP(A7,'Meldung (Reihung nach Spielnr.)'!$B$2:$C$97,2)","v":"Hans Perktold u Horst Friedl/Imst"}]
{"$rows_left_out":92}
{"sheet":"Auslosung3","index":6,"n_rows":97,"n_cols":8,"rows_kept":97,"cut":false,"hidden":false,"merged":[]}
[4,"Geben Sie in die grüne Zelle, die Anzahl der Paare ein",null,null,"Zahl","TISCH","Spieler Nr.","Name"]
[14,20,null,null,1,1,{"$f":"A1","v":4},{"$f":"VLOOKUP(A1,'Meldung (Reihung nach Spielnr.)'!$B$2:$C$97,2)","v":"Andi Krajic u Peter Doblander/Tarrenz"}]
[12,{"$f":"'Meldung (Reihung nach Spielnr.)'!M1","v":20},null,null,2,1,{"$f":"A2","v":14},{"$f":"VLOOKUP(A2,'Meldung (Reihung nach Spielnr.)'!$B$2:$C$97,2)","v":"Hansjörg Hell u Franz Braunegger/Axams"}]
[9,null,null,null,3,2,12,{"$f":"VLOOKUP(A3,'Meldung (Reihung nach Spielnr.)'!$B$2:$C$97,2)","v":"Heinrich Ebner u Erich Peer/Südtirol"}]
[10,null,null,null,4,2,9,{"$f":"VLOOKUP(A4,'Meldung (Reihung nach Spielnr.)'!$B$2:$C$97,2)","v":"Rudi Kastner u Peter Tschenett/Imst"}]
[17,null,null,null,5,3,10,{"$f":"VLOOKUP(A5,'Meldung (Reihung nach Spielnr.)'!$B$2:$C$97,2)","v":"Franz Pellegrini u Hans Matha/Südtirol"}]
{"$rows_left_out":92}
{"sheet":"Runde 3","index":7,"n_rows":97,"n_cols":8,"rows_kept":97,"cut":false,"hidden":false,"merged":[[0,3,0,4]]}
["Paar Nr","Name","Runde 3","Ergebnis",null,"Punkte","Punkte",15]
[{"$f":"Auslosung3!G2","v":4},{"$f":"Auslosung3!H2","v":"Andi Krajic u Peter Doblander/Tarrenz"},{"$f":"IF(F3+G3>0,IF(H3=\"OK\",IF(F3<G3,F3,100+(F3-G3)),0),0)","v":0},null,null,{"$f":"VLOOKUP(A2,'Meldung (Reihung nach Spielnr.)'!$B$2:$C$97,2)","v":"Andi Krajic u Peter Doblander/Tarrenz"},{"$f":"VLOOKUP(A3,'Meldung (Reihung nach Spielnr.)'!$B$2:$C$97,2)","v":"Hansjörg Hell u Franz Braunegger/Axams"}]
[{"$f":"Auslosung3!G3","v":14},{"$f":"Auslosung3!H3","v":"Hansjörg Hell u Franz Braunegger/Axams"},{"$f":"IF(F3+G3>0,IF(H3=\"OK\",IF(G3<F3,G3,100+(G3-F3)),0),0)","v":0},null,null,null,0,{"$f":"IF(OR(F3>=15,G3>=15),\"OK\",\"Fehlende oder falsche EIngabe\")","v":"Fehlende oder falsche EIngabe"}]
[{"$f":"Auslosung3!G4","v":12},{"$f":"Auslosung3!H4","v":"Heinrich Ebner u Erich Peer/Südtirol"},{"$f":"IF(F5+G5>0,IF(H5=\"OK\",IF(F5<G5,F5,100+(F5-G5)),0),0)","v":0},null,null,{"$f":"VLOOKUP(A4,'Meldung (Reihung nach Spielnr.)'!$B$2:$C$97,2)","v":"Heinrich Ebner u Erich Peer/Südtirol"},{"$f":"VLOOKUP(A5,'Meldung (Reihung nach Spielnr.)'!$B$2:$C$97,2)","v":"Rudi Kastner u Peter Tschenett/Imst"}]
[{"$f":"Auslosung3!G5","v":9},{"$f":"Auslosung3!H5","v":"Rudi Kastner u Peter Tschenett/Imst"},{"$f":"IF(F5+G5>0,IF(H5=\"OK\",IF(G5<F5,G5,100+(G5-F5)),0),0)","v":0},null,null,null,0,{"$f":"IF(OR(F5>=15,G5>=15),\"OK\",\"Fehlende oder falsche EIngabe\")","v":"Fehlende oder falsche EIngabe"}]
[{"$f":"Auslosung3!G6","v":10},{"$f":"Auslosung3!H6","v":"Franz Pellegrini u Hans Matha/Südtirol"},{"$f":"IF(F7+G7>0,IF(H7=\"OK\",IF(F7<G7,F7,100+(F7-G7)),0),0)","v":0},null,null,{"$f":"VLOOKUP(A6,'Meldung (Reihung nach Spielnr.)'!$B$2:$C$97,2)","v":"Franz Pellegrini u Hans Matha/Südtirol"},{"$f":"VLOOKUP(A7,'Meldung (Reihung nach Spielnr.)'!$B$2:$C$97,2)","v":"Karin Logar u Rudolf Häusler/Kematen"}]
{"$rows_left_out":92}
{"sheet":"Auslosung4","index":8,"n_rows":97,"n_cols":8,"rows_kept":97,"cut":false,"hidden":false,"merged":[]}
[17,"Geben Sie in die grüne Zelle, die Anzahl der Mitspieler ein",null,null,"Zahl","TISCH","Spieler Nr.","Name"]
[1,{"$f":"Auslosung1!B2","v":20},null,null,1,1,{"$f":"A1","v":17},{"$f":"VLOOKUP(A1,'Meldung (Reihung nach Spielnr.)'!$B$2:$C$97,2)","v":"Karin Logar u Rudolf Häusler/Kematen"}]
[11,{"$f":"'Meldung (Reihung nach Spielnr.)'!M1","v":20},null,null,2,1,{"$f":"A2","v":1},{"$f":"VLOOKUP(A2,'Meldung (Reihung nach Spielnr.)'!$B$2:$C$97,2)","v":"Edi u Gerald/Telfs"}]
[3,null,null,null,3,2,11,{"$f":"VLOOKUP(A3,'Meldung (Reihung nach Spielnr.)'!$B$2:$C$97,2)","v":"Heini Gruber u Gottfried Geier/Südtirol"}]
[6,null,null,null,4,2,3,{"$f":"VLOOKUP(A4,'Meldung (Reihung nach Spielnr.)'!$B$2:$C$97,2)","v":"Hubert Auer u Daniela Nöbauer/Telfs"}]
[16,null,null,null,5,3,6,{"$f":"VLOOKUP(A5,'Meldung (Reihung nach Spielnr.)'!$B$2:$C$97,2)","v":"Hans Perktold u Horst Friedl/Imst"}]
{"$rows_left_out":92}
{"sheet":"Runde 4","index":9,"n_rows":97,"n_cols":8,"rows_kept":97,"cut":false,"hidden":false,"merged":[[0,3,0,4]]}
["Spielnr.","Name","Runde 4",null,null,"Punkte","Punkte",15]
[{"$f":"Auslosung4!G2","v":17},{"$f":"Auslosung4!H2","v":"Karin Logar u Rudolf Häusler/Kematen"},{"$f":"IF(F3+G3>0,IF(H3=\"OK\",IF(F3<G3,F3,100+(F3-G3)),0),0)","v":112},null,null,{"$f":"VLOOKUP(A2,'Meldung (Reihung nach Spielnr.)'!$B$2:$C$97,2)","v":"Karin Logar u Rudolf Häusler/Kematen"},{"$f":"VLOOKUP(A3,'Meldung (Reihung nach Spielnr.)'!$B$2:$C$97,2)","v":"Edi u Gerald/Telfs"}]
[{"$f":"Auslosung4!G3","v":1},{"$f":"Auslosung4!H3","v":"Edi u Gerald/Telfs"},{"$f":"IF(F3+G3>0,IF(H3=\"OK\",IF(G3<F3,G3,100+(G3-F3)),0),0)","v":3},null,null,15,3,{"$f":"IF(OR(F3>=15,G3>=15),\"OK\",\"Fehlende oder falsche EIngabe\")","v":"OK"}]
[{"$f":"Auslosung4!G4","v":11},{"$f":"Auslosung4!H4","v":"Heini Gruber u Gottfried Geier/Südtirol"},{"$f":"IF(F5+G5>0,IF(H5=\"OK\",IF(F5<G5,F5,100+(F5-G5)),0),0)","v":0},null,null,{"$f":"VLOOKUP(A4,'Meldung (Reihung nach Spielnr.)'!$B$2:$C$97,2)","v":"Heini Gruber u Gottfried Geier/Südtirol"},{"$f":"VLOOKUP(A5,'Meldung (Reihung nach Spielnr.)'!$B$2:$C$97,2)","v":"Hubert Auer u Daniela Nöbauer/Telfs"}]
[{"$f":"Auslosung4!G5","v":3},{"$f":"Auslosung4!H5","v":"Hubert Auer u Daniela Nöbauer/Telfs"},{"$f":"IF(F5+G5>0,IF(H5=\"OK\",IF(G5<F5,G5,100+(G5-F5)),0),0)","v":0},null,null,null,0,{"$f":"IF(OR(F5>=15,G5>=15),\"OK\",\"Fehlende oder falsche EIngabe\")","v":"Fehlende oder falsche EIngabe"}]
[{"$f":"Auslosung4!G6","v":6},{"$f":"Auslosung4!H6","v":"Hans Perktold u Horst Friedl/Imst"},{"$f":"IF(F7+G7>0,IF(H7=\"OK\",IF(F7<G7,F7,100+(F7-G7)),0),0)","v":0},null,null,{"$f":"VLOOKUP(A6,'Meldung (Reihung nach Spielnr.)'!$B$2:$C$97,2)","v":"Hans Perktold u Horst Friedl/Imst"},{"$f":"VLOOKUP(A7,'Meldung (Reihung nach Spielnr.)'!$B$2:$C$97,2)","v":"Hermann Lechner u Andreas Oberacher/Kematen"}]
{"$rows_left_out":92}
{"sheet":"Auslosung5","index":10,"n_rows":97,"n_cols":8,"rows_kept":97,"cut":false,"hidden":false,"merged":[]}
[19,"Geben Sie in die grüne Zelle, die Anzahl der Mitspieler ein",null,null,"Zahl","TISCH","Spieler Nr.","Name"]
[2,{"$f":"Auslosung1!B2","v":20},null,null,1,1,{"$f":"A1","v":19},{"$f":"VLOOKUP(A1,'Meldung (Reihung nach Spielnr.)'!$B$2:$C$97,2)","v":"Kurt Zebisch | Mr. Bean"}]
[4,{"$f":"'Meldung (Reihung nach Spielnr.)'!M1","v":20},null,null,2,1,{"$f":"A2","v":2},{"$f":"VLOOKUP(A2,'Meldung (Reihung nach Spielnr.)'!$B$2:$C$97,2)","v":"Annette u Veronika/Telfs"}]
[8,null,null,null,3,2,4,{"$f":"VLOOKUP(A3,'Meldung (Reihung nach Spielnr.)'!$B$2:$C$97,2)","v":"Andi Krajic u Peter Doblander/Tarrenz"}]
[15,null,null,null,4,2,8,{"$f":"VLOOKUP(A4,'Meldung (Reihung nach Spielnr.)'!$B$2:$C$97,2)","v":"Herbert Lechleitner u  Stefan Krabichler/Imst"}]
[5,null,null,null,5,3,15,{"$f":"VLOOKUP(A5,'Meldung (Reihung nach Spielnr.)'!$B$2:$C$97,2)","v":"Bernhard Meischberger u Martin Staggl/Kematen"}]
{"$rows_left_out":92}
{"sheet":"Runde 5","index":11,"n_rows":97,"n_cols":8,"rows_kept":97,"cut":false,"hidden":false,"merged":[[0,3,0,4]]}
["Spielnr.","Name","Runde 5",null,null,"Punkte","Punkte",15]
[{"$f":"Auslosung5!G2","v":19},{"$f":"Auslosung5!H2","v":"Kurt Zebisch | Mr. Bean"},{"$f":"IF(F3+G3>0,IF(H3=\"OK\",IF(F3<G3,F3,100+(F3-G3)),0),0)","v":0},null,null,{"$f":"VLOOKUP(A2,'Meldung (Reihung nach Spielnr.)'!$B$2:$C$97,2)","v":"Kurt Zebisch | Mr. Bean"},{"$f":"VLOOKUP(A3,'Meldung (Reihung nach Spielnr.)'!$B$2:$C$97,2)","v":"Annette u Veronika/Telfs"}]
[{"$f":"Auslosung5!G3","v":2},{"$f":"Auslosung5!H3","v":"Annette u Veronika/Telfs"},{"$f":"IF(F3+G3>0,IF(H3=\"OK\",IF(G3<F3,G3,100+(G3-F3)),0),0)","v":0},null,null,null,null,{"$f":"IF(OR(F3>=15,G3>=15),\"OK\",\"Fehlende oder falsche EIngabe\")","v":"Fehlende oder falsche EIngabe"}]
[{"$f":"Auslosung5!G4","v":4},{"$f":"Auslosung5!H4","v":"Andi Krajic u Peter Doblander/Tarrenz"},{"$f":"IF(F5+G5>0,IF(H5=\"OK\",IF(F5<G5,F5,100+(F5-G5)),0),0)","v":0},null,null,{"$f":"VLOOKUP(A4,'Meldung (Reihung nach Spielnr.)'!$B$2:$C$97,2)","v":"Andi Krajic u Peter Doblander/Tarrenz"},{"$f":"VLOOKUP(A5,'Meldung (Reihung nach Spielnr.)'!$B$2:$C$97,2)","v":"Herbert Lechleitner u  Stefan Krabichler/Imst"}]
[{"$f":"Auslosung5!G5","v":8},{"$f":"Auslosung5!H5","v":"Herbert Lechleitner u  Stefan Krabichler/Imst"},{"$f":"IF(F5+G5>0,IF(H5=\"OK\",IF(G5<F5,G5,100+(G5-F5)),0),0)","v":0},null,null,null,null,{"$f":"IF(OR(F5>=15,G5>=15),\"OK\",\"Fehlende oder falsche EIngabe\")","v":"Fehlende oder falsche EIngabe"}]
[{"$f":"Auslosung5!G6","v":15},{"$f":"Auslosung5!H6","v":"Bernhard Meischberger u Martin Staggl/Kematen"},{"$f":"IF(F7+G7>0,IF(H7=\"OK\",IF(F7<G7,F7,100+(F7-G7)),0),0)","v":0},null,null,{"$f":"VLOOKUP(A6,'Meldung (Reihung nach Spielnr.)'!$B$2:$C$97,2)","v":"Bernhard Meischberger u Martin Staggl/Kematen"},{"$f":"VLOOKUP(A7,'Meldung (Reihung nach Spielnr.)'!$B$2:$C$97,2)","v":"Gerhard Schuler u Meinhard Eiter/Imst"}]
{"$rows_left_out":92}
{"sheet":"Auslosung6","index":12,"n_rows":97,"n_cols":8,"rows_kept":97,"cut":false,"hidden":false,"merged":[]}
[13,"Geben Sie in die grüne Zelle, die Anzahl der Mitspieler ein",null,null,"Zahl","TISCH","Spieler Nr.","Name"]
[12,{"$f":"Auslosung1!B2","v":20},null,null,1,1,{"$f":"A1","v":13},{"$f":"VLOOKUP(A1,'Meldung (Reihung nach Spielnr.)'!$B$2:$C$97,2)","v":"Peter Auer u Stefan Sarg/Axams"}]
[16,{"$f":"'Meldung (Reihung nach Spielnr.)'!M1","v":20},null,null,2,1,{"$f":"A2","v":12},{"$f":"VLOOKUP(A2,'Meldung (Reihung nach Spielnr.)'!$B$2:$C$97,2)","v":"Heinrich Ebner u Erich Peer/Südtirol"}]
[2,null,null,null,3,2,16,{"$f":"VLOOKUP(A3,'Meldung (Reihung nach Spielnr.)'!$B$2:$C$97,2)","v":"Hermann Lechner u Andreas Oberacher/Kematen"}]
[4,null,null,null,4,2,2,{"$f":"VLOOKUP(A4,'Meldung (Reihung nach Spielnr.)'!$B$2:$C$97,2)","v":"Annette u Veronika/Telfs"}]
[5,null,null,null,5,3,4,{"$f":"VLOOKUP(A5,'Meldung (Reihung nach Spielnr.)'!$B$2:$C$97,2)","v":"Andi Krajic u Peter Doblander/Tarrenz"}]
{"$rows_left_out":92}
{"sheet":"Runde 6","index":13,"n_rows":97,"n_cols":8,"rows_kept":97,"cut":false,"hidden":false,"merged":[[0,3,0,4]]}
["Spielnr.","Name","Runde 6",null,null,"Punkte","Punkte",15]
[{"$f":"Auslosung6!G2","v":13},{"$f":"Auslosung6!H2","v":"Peter Auer u Stefan Sarg/Axams"},{"$f":"IF(F3+G3>0,IF(H3=\"OK\",IF(F3<G3,F3,100+(F3-G3)),0),0)","v":0},null,null,{"$f":"VLOOKUP(A2,'Meldung (Reihung nach Spielnr.)'!$B$2:$C$97,2)","v":"Peter Auer u Stefan Sarg/Axams"},{"$f":"VLOOKUP(A3,'Meldung (Reihung nach Spielnr.)'!$B$2:$C$97,2)","v":"Heinrich Ebner u Erich Peer/Südtirol"}]
[{"$f":"Auslosung6!G3","v":12},{"$f":"Auslosung6!H3","v":"Heinrich Ebner u Erich Peer/Südtirol"},{"$f":"IF(F3+G3>0,IF(H3=\"OK\",IF(G3<F3,G3,100+(G3-F3)),0),0)","v":0},null,null,0,null,{"$f":"IF(OR(F3>=15,G3>=15),\"OK\",\"Fehlende oder falsche EIngabe\")","v":"Fehlende oder falsche EIngabe"}]
[{"$f":"Auslosung6!G4","v":16},{"$f":"Auslosung6!H4","v":"Hermann Lechner u Andreas Oberacher/Kematen"},{"$f":"IF(F5+G5>0,IF(H5=\"OK\",IF(F5<G5,F5,100+(F5-G5)),0),0)","v":0},null,null,{"$f":"VLOOKUP(A4,'Meldung (Reihung nach Spielnr.)'!$B$2:$C$97,2)","v":"Hermann Lechner u Andreas Oberacher/Kematen"},{"$f":"VLOOKUP(A5,'Meldung (Reihung nach Spielnr.)'!$B$2:$C$97,2)","v":"Annette u Veronika/Telfs"}]
[{"$f":"Auslosung6!G5","v":2},{"$f":"Auslosung6!H5","v":"Annette u Veronika/Telfs"},{"$f":"IF(F5+G5>0,IF(H5=\"OK\",IF(G5<F5,G5,100+(G5-F5)),0),0)","v":0},null,null,null,0,{"$f":"IF(OR(F5>=15,G5>=15),\"OK\",\"Fehlende oder falsche EIngabe\")","v":"Fehlende oder falsche EIngabe"}]
[{"$f":"Auslosung6!G6","v":4},{"$f":"Auslosung6!H6","v":"Andi Krajic u Peter Doblander/Tarrenz"},{"$f":"IF(F7+G7>0,IF(H7=\"OK\",IF(F7<G7,F7,100+(F7-G7)),0),0)","v":0},null,null,{"$f":"VLOOKUP(A6,'Meldung (Reihung nach Spielnr.)'!$B$2:$C$97,2)","v":"Andi Krajic u Peter Doblander/Tarrenz"},{"$f":"VLOOKUP(A7,'Meldung (Reihung nach Spielnr.)'!$B$2:$C$97,2)","v":"Gerhard Schuler u Meinhard Eiter/Imst"}]
{"$rows_left_out":92}
{"sheet":"Auslosung7","index":14,"n_rows":97,"n_cols":8,"rows_kept":97,"cut":false,"hidden":false,"merged":[]}
[20,"Geben Sie in die grüne Zelle, die Anzahl der Mitspieler ein",null,null,"Zahl","TISCH","Spieler Nr.","Name"]
[19,{"$f":"Auslosung1!B2","v":20},null,null,1,1,{"$f":"A1","v":20},{"$f":"VLOOKUP(A1,'Meldung (Reihung nach Spielnr.)'!$B$2:$C$97,2)","v":"Krissmer Reinhard | Fringer Fred"}]
[4,{"$f":"'Meldung (Reihung nach Spielnr.)'!M1","v":20},null,null,2,1,{"$f":"A2","v":19},{"$f":"VLOOKUP(A2,'Meldung (Reihung nach Spielnr.)'!$B$2:$C$97,2)","v":"Kurt Zebisch | Mr. Bean"}]
[2,null,null,null,3,2,4,{"$f":"VLOOKUP(A3,'Meldung (Reihung nach Spielnr.)'!$B$2:$C$97,2)","v":"Andi Krajic u Peter Doblander/Tarrenz"}]
[5,null,null,null,4,2,2,{"$f":"VLOOKUP(A4,'Meldung (Reihung nach Spielnr.)'!$B$2:$C$97,2)","v":"Annette u Veronika/Telfs"}]
[9,null,null,null,5,3,5,{"$f":"VLOOKUP(A5,'Meldung (Reihung nach Spielnr.)'!$B$2:$C$97,2)","v":"Gerhard Schuler u Meinhard Eiter/Imst"}]
{"$rows_left_out":92}
{"sheet":"Runde 7","index":15,"n_rows":97,"n_cols":8,"rows_kept":97,"cut":false,"hidden":false,"merged":[[0,3,0,4]]}
["Paar-Nr.","Name","Runde 4",null,null,"Punkte","Punkte",15]
[{"$f":"Auslosung7!G2","v":20},{"$f":"Auslosung7!H2","v":"Krissmer Reinhard | Fringer Fred"},{"$f":"IF(F3+G3>0,IF(H3=\"OK\",IF(F3<G3,F3,100+(F3-G3)),0),0)","v":0},null,null,{"$f":"VLOOKUP(A2,'Meldung (Reihung nach Spielnr.)'!$B$2:$C$97,2)","v":"Krissmer Reinhard | Fringer Fred"},{"$f":"VLOOKUP(A3,'Meldung (Reihung nach Spielnr.)'!$B$2:$C$97,2)","v":"Kurt Zebisch | Mr. Bean"}]
[{"$f":"Auslosung7!G3","v":19},{"$f":"Auslosung7!H3","v":"Kurt Zebisch | Mr. Bean"},{"$f":"IF(F3+G3>0,IF(H3=\"OK\",IF(G3<F3,G3,100+(G3-F3)),0),0)","v":0},null,null,null,0,{"$f":"IF(OR(F3>=15,G3>=15),\"OK\",\"Fehlende oder falsche EIngabe\")","v":"Fehlende oder falsche EIngabe"}]
[{"$f":"Auslosung7!G4","v":4},{"$f":"Auslosung7!H4","v":"Andi Krajic u Peter Doblander/Tarrenz"},{"$f":"IF(F5+G5>0,IF(H5=\"OK\",IF(F5<G5,F5,100+(F5-G5)),0),0)","v":0},null,null,{"$f":"VLOOKUP(A4,'Meldung (Reihung nach Spielnr.)'!$B$2:$C$97,2)","v":"Andi Krajic u Peter Doblander/Tarrenz"},{"$f":"VLOOKUP(A5,'Meldung (Reihung nach Spielnr.)'!$B$2:$C$97,2)","v":"Annette u Veronika/Telfs"}]
[{"$f":"Auslosung7!G5","v":2},{"$f":"Auslosung7!H5","v":"Annette u Veronika/Telfs"},{"$f":"IF(F5+G5>0,IF(H5=\"OK\",IF(G5<F5,G5,100+(G5-F5)),0),0)","v":0},null,null,null,0,{"$f":"IF(OR(F5>=15,G5>=15),\"OK\",\"Fehlende oder falsche EIngabe\")","v":"Fehlende oder falsche EIngabe"}]
[{"$f":"Auslosung7!G6","v":5},{"$f":"Auslosung7!H6","v":"Gerhard Schuler u Meinhard Eiter/Imst"},{"$f":"IF(F7+G7>0,IF(H7=\"OK\",IF(F7<G7,F7,100+(F7-G7)),0),0)","v":0},null,null,{"$f":"VLOOKUP(A6,'Meldung (Reihung nach Spielnr.)'!$B$2:$C$97,2)","v":"Gerhard Schuler u Meinhard Eiter/Imst"},{"$f":"VLOOKUP(A7,'Meldung (Reihung nach Spielnr.)'!$B$2:$C$97,2)","v":"Rudi Kastner u Peter Tschenett/Imst"}]
{"$rows_left_out":92}
{"sheet":"Hinweis","index":16,"n_rows":3,"n_cols":3,"rows_kept":3,"cut":false,"hidden":false,"merged":[]}
[]
[]
[null,"Hinweis: ","Achtung, damit die Sortierung der Ergebnisse aktualisiert wird, auf den Filter wie unten dargestellt klicken und einfach nochmals auf \"Nach Größe sortieren (absteigend)\" klicken - siehe Pfeil!"]